{"text_format":"1","workbook":"xlsx","n_sheets":7,"sheets":["Raw Greek (2)","Raw Greek","Linear","Parse","Parse2","GreekWords","Parse2 (2)"],"not_rendered":{"charts":0,"images":0,"macros":1,"external_links":0,"defined_names":0,"comments":0,"pivot_tables":0},"unopened":[],"bounds":{"document_bytes":16777216,"sheet_cells":100000,"rows_first":2000,"rows_last":500,"rows_between":2000,"halvings":0,"cell_chars":16384,"cell_head_chars":4096},"cells_cut":0,"cells_raw":0,"read":"whole","date_system":"1900"}

{"sheet":"Raw Greek (2)","index":0,"n_rows":9,"n_cols":1,"rows_kept":9,"cut":false,"hidden":false,"merged":[]}
["1Βίβλος γενέσεως Ἰησοῦ Χριστοῦ υἱοῦ Δαυὶδ υἱοῦ Ἀβραάμ."]
["2Ἀβραὰμ ἐγέννησεν τὸν Ἰσαάκ, Ἰσαὰκ δὲ ἐγέννησεν τὸν Ἰακώβ, Ἰακὼβ δὲ ἐγέννησεν τὸν Ἰούδαν καὶ τοὺς ἀδελφοὺς αὐτοῦ, 3Ἰούδας δὲ ἐγέννησεν τὸν Φάρες καὶ τὸν Ζάρα ἐκ τῆς Θαμάρ, Φάρες δὲ ἐγέννησεν τὸν Ἑσρώμ, Ἑσρὼμ δὲ ἐγέννησεν τὸν Ἀράμ, 4Ἀρὰμ δὲ ἐγέννησεν τὸν Ἀμιναδάβ, Ἀμιναδὰβ δὲ ἐγέννησεν τὸν Ναασσών, Ναασσὼν δὲ ἐγέννησεν τὸν Σαλμών, 5Σαλμὼν δὲ ἐγέννησεν τὸν Βόες ἐκ τῆς Ῥαχάβ, Βόες δὲ ἐγέννησεν τὸν Ἰωβὴδ ἐκ τῆς Ῥούθ, Ἰωβὴδ δὲ ἐγέννησεν τὸν Ἰεσσαί, 6Ἰεσσαὶ δὲ ἐγέννησεν τὸν Δαυὶδ τὸν βασιλέα."]
["Δαυὶδ δὲ ἐγέννησεν τὸν Σολομῶνα ἐκ τῆς τοῦ Οὐρίου, 7Σολομὼν δὲ ἐγέννησεν τὸν Ῥοβοάμ, Ῥοβοὰμ δὲ ἐγέννησεν τὸν Ἀβιά, Ἀβιὰ δὲ ἐγέννησεν τὸν Ἀσάφ, 8Ἀσὰφ δὲ ἐγέννησεν τὸν Ἰωσαφάτ, Ἰωσαφὰτ δὲ ἐγέννησεν τὸν Ἰωράμ, Ἰωρὰμ δὲ ἐγέννησεν τὸν Ὀζίαν, 9Ὀζίας δὲ ἐγέννησεν τὸν Ἰωαθάμ, Ἰωαθὰμ δὲ ἐγέννησεν τὸν Ἀχάζ, Ἀχὰζ δὲ ἐγέννησεν τὸν Ἑζεκίαν, 10Ἑζεκίας δὲ ἐγέννησεν τὸν Μανασσῆ, Μανασσῆς δὲ ἐγέννησεν τὸν Ἀμώς, Ἀμὼς δὲ ἐγέννησεν τὸν Ἰωσίαν, 11Ἰωσίας δὲ ἐγέννησεν τὸν Ἰεχονίαν καὶ τοὺς ἀδελφοὺς αὐτοῦ ἐπὶ τῆς μετοικεσίας Βαβυλῶνος."]
["12Μετὰ δὲ τὴν μετοικεσίαν Βαβυλῶνος Ἰεχονίας ἐγέννησεν τὸν Σαλαθιήλ, Σαλαθιὴλ δὲ ἐγέννησεν τὸν Ζοροβαβέλ, 13Ζοροβαβὲλ δὲ ἐγέννησεν τὸν Ἀβιούδ, Ἀβιοὺδ δὲ ἐγέννησεν τὸν Ἐλιακίμ, Ἐλιακὶμ δὲ ἐγέννησεν τὸν Ἀζώρ, 14Ἀζὼρ δὲ ἐγέννησεν τὸν Σαδώκ, Σαδὼκ δὲ ἐγέννησεν τὸν Ἀχίμ, Ἀχὶμ δὲ ἐγέννησεν τὸν Ἐλιούδ, 15Ἐλιοὺδ δὲ ἐγέννησεν τὸν Ἐλεάζαρ, Ἐλεάζαρ δὲ ἐγέννησεν τὸν Ματθάν, Ματθὰν δὲ ἐγέννησεν τὸν Ἰακώβ, 16Ἰακὼβ δὲ ἐγέννησεν τὸν Ἰωσὴφ τὸν ἄνδρα Μαρίας, ἐξ ἧς ἐγεννήθη Ἰησοῦς ὁ λεγόμενος Χριστός."]
["17Πᾶσαι οὖν αἱ γενεαὶ ἀπὸ Ἀβραὰμ ἕως Δαυὶδ γενεαὶ δεκατέσσαρες, καὶ ἀπὸ Δαυὶδ ἕως τῆς μετοικεσίας Βαβυλῶνος γενεαὶ δεκατέσσαρες, καὶ ἀπὸ τῆς μετοικεσίας Βαβυλῶνος ἕως τοῦ Χριστοῦ γενεαὶ δεκατέσσαρες."]
["18Τοῦ δὲ Ἰησοῦ Χριστοῦ ἡ γένεσις οὕτως ἦν. μνηστευθείσης τῆς μητρὸς αὐτοῦ Μαρίας τῷ Ἰωσήφ, πρὶν ἢ συνελθεῖν αὐτοὺς εὑρέθη ἐν γαστρὶ ἔχουσα ἐκ πνεύματος ἁγίου. 19Ἰωσὴφ δὲ ὁ ἀνὴρ αὐτῆς, δίκαιος ὢν καὶ μὴ θέλων αὐτὴν δειγματίσαι, ἐβουλήθη λάθρᾳ ἀπολῦσαι αὐτήν. 20ταῦτα δὲ αὐτοῦ ἐνθυμηθέντος ἰδοὺ ἄγγελος κυρίου κατ’ ὄναρ ἐφάνη αὐτῷ λέγων· Ἰωσὴφ υἱὸς Δαυίδ, μὴ φοβηθῇς παραλαβεῖν Μαρίαν τὴν γυναῖκά σου· τὸ γὰρ ἐν αὐτῇ γεννηθὲν ἐκ πνεύματός ἐστιν ἁγίου. 21τέξεται δὲ υἱόν, καὶ καλέσεις τὸ ὄνομα αὐτοῦ Ἰησοῦν· αὐτὸς γὰρ σώσει τὸν λαὸν αὐτοῦ ἀπὸ τῶν ἁμαρτιῶν αὐτῶν. 22τοῦτο δὲ ὅλον γέγονεν ἵνα πληρωθῇ τὸ ῥηθὲν ὑπὸ κυρίου διὰ τοῦ προφήτου λέγοντος·"]
["23ἰδοὺ ἡ παρθένος ἐν γαστρὶ ἕξει καὶ τέξεται υἱόν,"]
["καὶ καλέσουσιν τὸ ὄνομα αὐτοῦ Ἐμμανουήλ,"]
["ὅ ἐστιν μεθερμηνευόμενον μεθ’ ἡμῶν ὁ θεός. 24ἐγερθεὶς δὲ ὁ Ἰωσὴφ ἀπὸ τοῦ ὕπνου ἐποίησεν ὡς προσέταξεν αὐτῷ ὁ ἄγγελος κυρίου καὶ παρέλαβεν τὴν γυναῖκα αὐτοῦ, 25καὶ οὐκ ἐγίνωσκεν αὐτὴν ἕως οὗ ἔτεκεν υἱόν· καὶ ἐκάλεσεν τὸ ὄνομα αὐτοῦ Ἰησοῦν."]

{"sheet":"Raw Greek","index":1,"n_rows":3,"n_cols":1,"rows_kept":3,"cut":false,"hidden":false,"merged":[]}
["1Βίβλος "]
["2Ἀβραὰμ ἐγέννησ."]
["12Δαυὶδ δὲ ἐγέννησεν τὸν 13 Σολομῶ"]

{"sheet":"Linear","index":2,"n_rows":20,"n_cols":3,"rows_kept":20,"cut":false,"hidden":false,"merged":[]}
[1,8,"1Βίβλος "]
[2,16,"2Ἀβραὰμ ἐγέννησ."]
[3,34,"12Δαυὶδ δὲ ἐγέννησεν τὸν 13 Σολομῶ"]
[4,0]
[5,0]
[6,0]
[7,0]
[8,0]
[9,0]
[10,0]
[11,0]
[12,0]
[13,0]
[14,0]
[15,0]
[16,0]
[17,0]
[18,0]
[19,0]
[20,0]

{"sheet":"Parse","index":3,"n_rows":34,"n_cols":3,"rows_kept":34,"cut":false,"hidden":false,"merged":[]}
[1,2,1]
["Β","Ἀ",2]
["ί","β","Δ"]
["β","ρ","α"]
["λ","α","υ"]
["ο","ὰ","ὶ"]
["ς","μ","δ"]
[" "," "," "]
[null,"ἐ","δ"]
[null,"γ","ὲ"]
[null,"έ"," "]
[null,"ν","ἐ"]
[null,"ν","γ"]
[null,"η","έ"]
[null,"σ","ν"]
[null,".","ν"]
[null,null,"η"]
[null,null,"σ"]
[null,null,"ε"]
[null,null,"ν"]
[null,null," "]
[null,null,"τ"]
[null,null,"ὸ"]
[null,null,"ν"]
[null,null," "]
[null,null,1]
[null,null,3]
[null,null," "]
[null,null,"Σ"]
[null,null,"ο"]
[null,null,"λ"]
[null,null,"ο"]
[null,null,"μ"]
[null,null,"ῶ"]

{"sheet":"Parse2","index":4,"n_rows":3312,"n_cols":5,"rows_kept":3312,"cut":false,"hidden":false,"merged":[]}
[1,{"$f":"IF((C1 > 0),\"space\",(IF((D1 > 0),\"num\",(IF((E1 > 0),\"punch\",\"text\")))))","v":"num"},{"$f":"IFERROR(FIND(A1,\" \",1),0)","v":0},{"$f":"IFERROR(FIND(A1,\"1234567890\",1),0)","v":1},{"$f":"IFERROR(FIND(A1,\".,\",1),0)","v":0}]
[2,{"$f":"IF((C2 > 0),\"space\",(IF((D2 > 0),\"num\",(IF((E2 > 0),\"punch\",\"text\")))))","v":"num"},{"$f":"IFERROR(FIND(A2,\" \",1),0)","v":0},{"$f":"IFERROR(FIND(A2,\"1234567890\",1),0)","v":2},{"$f":"IFERROR(FIND(A2,\".,\",1),0)","v":0}]
["Δ","text",0,0,0]
["α","text",0,0,0]
["υ","text",0,0,0]
["ὶ","text",0,0,0]
["δ","text",0,0,0]
[" ","space",1,0,0]
["δ","text",0,0,0]
["ὲ","text",0,0,0]
[" ","space",1,0,0]
["ἐ","text",0,0,0]
["γ","text",0,0,0]
["έ","text",0,0,0]
["ν","text",0,0,0]
["ν","text",0,0,0]
["η","text",0,0,0]
["σ","text",0,0,0]
["ε","text",0,0,0]
["ν",{"$f":"IF((C20 > 0),\"space\",(IF((D20 > 0),\"num\",(IF((E20 > 0),\"punch\",\"text\")))))","v":"text"},0,0,0]
[" ","space",1,0,0]
["τ","text",0,0,0]
["ὸ","text",0,0,0]
["ν","text",0,0,0]
[" ","space",1,0,0]
[1,"num",0,1,0]
[3,"num",0,3,0]
[" ","space",1,0,0]
["Σ","text",0,0,0]
["ο","text",0,0,0]
["λ","text",0,0,0]
["ο","text",0,0,0]
["μ","text",0,0,0]
["ῶ","text",0,0,0]
[null,"space",1,1,1]
[null,"space",1,1,1]
[null,"space",1,1,1]
[null,"space",1,1,1]
[null,"space",1,1,1]
[null,"space",1,1,1]
[null,"space",1,1,1]
[null,"space",1,1,1]
[null,"space",1,1,1]
[null,"space",1,1,1]
[null,"space",1,1,1]
[null,"space",1,1,1]
[null,"space",1,1,1]
[null,"space",1,1,1]
[null,"space",1,1,1]
[null,"space",1,1,1]
[null,"space",1,1,1]
[null,"space",1,1,1]
[null,"space",1,1,1]
[null,"space",1,1,1]
[null,"space",1,1,1]
[null,"space",1,1,1]
[null,"space",1,1,1]
[null,"space",1,1,1]
[null,"space",1,1,1]
[null,"space",1,1,1]
[null,"space",1,1,1]
[null,"space",1,1,1]
[null,"space",1,1,1]
[null,"space",1,1,1]
[null,"space",1,1,1]
[null,"space",{"$f":"IFERROR(FIND(A66,\" \",1),0)","v":1},{"$f":"IFERROR(FIND(A66,\"1234567890\",1),0)","v":1},{"$f":"IFERROR(FIND(A66,\".,\",1),0)","v":1}]
[null,"space",1,1,1]
[null,"space",1,1,1]
[null,"space",1,1,1]
[null,"space",1,1,1]
[null,"space",1,1,1]
[null,"space",1,1,1]
[null,"space",1,1,1]
[null,"space",1,1,1]
[null,"space",1,1,1]
[null,"space",1,1,1]
[null,"space",1,1,1]
[null,"space",1,1,1]
[null,"space",1,1,1]
[null,"space",1,1,1]
[null,"space",1,1,1]
[null,"space",1,1,1]
[null,"space",1,1,1]
[null,{"$f":"IF((C84 > 0),\"space\",(IF((D84 > 0),\"num\",(IF((E84 > 0),\"punch\",\"text\")))))","v":"space"},1,1,1]
[null,"space",1,1,1]
[null,"space",1,1,1]
[null,"space",1,1,1]
[null,"space",1,1,1]
[null,"space",1,1,1]
[null,"space",1,1,1]
[null,"space",1,1,1]
[null,"space",1,1,1]
[null,"space",1,1,1]
[null,"space",1,1,1]
[null,"space",1,1,1]
[null,"space",1,1,1]
[null,"space",1,1,1]
[null,"space",1,1,1]
[null,"space",1,1,1]
[null,"space",1,1,1]
[null,"space",1,1,1]
[null,"space",1,1,1]
[null,"space",1,1,1]
[null,"space",1,1,1]
[null,"space",1,1,1]
[null,"space",1,1,1]
[null,"space",1,1,1]
[null,"space",1,1,1]
[null,"space",1,1,1]
[null,"space",1,1,1]
[null,"space",1,1,1]
[null,"space",1,1,1]
[null,"space",1,1,1]
[null,"space",1,1,1]
[null,"space",1,1,1]
[null,"space",1,1,1]
[null,"space",1,1,1]
[null,"space",1,1,1]
[null,"space",1,1,1]
[null,"space",1,1,1]
[null,"space",1,1,1]
[null,"space",1,1,1]
[null,"space",1,1,1]
[null,"space",1,1,1]
[null,"space",1,1,1]
[null,"space",1,1,1]
[null,"space",1,1,1]
[null,"space",1,1,1]
[null,"space",1,1,1]
[null,"space",{"$f":"IFERROR(FIND(A130,\" \",1),0)","v":1},{"$f":"IFERROR(FIND(A130,\"1234567890\",1),0)","v":1},{"$f":"IFERROR(FIND(A130,\".,\",1),0)","v":1}]
[null,"space",1,1,1]
[null,"space",1,1,1]
[null,"space",1,1,1]
[null,"space",1,1,1]
[null,"space",1,1,1]
[null,"space",1,1,1]
[null,"space",1,1,1]
[null,"space",1,1,1]
[null,"space",1,1,1]
[null,"space",1,1,1]
[null,"space",1,1,1]
[null,"space",1,1,1]
[null,"space",1,1,1]
[null,"space",1,1,1]
[null,"space",1,1,1]
[null,"space",1,1,1]
[null,"space",1,1,1]
[null,{"$f":"IF((C148 > 0),\"space\",(IF((D148 > 0),\"num\",(IF((E148 > 0),\"punch\",\"text\")))))","v":"space"},1,1,1]
[null,"space",1,1,1]
[null,"space",1,1,1]
[null,"space",1,1,1]
[null,"space",1,1,1]
[null,"space",1,1,1]
[null,"space",1,1,1]
[null,"space",1,1,1]
[null,"space",1,1,1]
[null,"space",1,1,1]
[null,"space",1,1,1]
[null,"space",1,1,1]
[null,"space",1,1,1]
[null,"space",1,1,1]
[null,"space",1,1,1]
[null,"space",1,1,1]
[null,"space",1,1,1]
[null,"space",1,1,1]
[null,"space",1,1,1]
[null,"space",1,1,1]
[null,"space",1,1,1]
[null,"space",1,1,1]
[null,"space",1,1,1]
[null,"space",1,1,1]
[null,"space",1,1,1]
[null,"space",1,1,1]
[null,"space",1,1,1]
[null,"space",1,1,1]
[null,"space",1,1,1]
[null,"space",1,1,1]
[null,"space",1,1,1]
[null,"space",1,1,1]
[null,"space",1,1,1]
[null,"space",1,1,1]
[null,"space",1,1,1]
[null,"space",1,1,1]
[null,"space",1,1,1]
[null,"space",1,1,1]
[null,"space",1,1,1]
[null,"space",1,1,1]
[null,"space",1,1,1]
[null,"space",1,1,1]
[null,"space",1,1,1]
[null,"space",1,1,1]
[null,"space",1,1,1]
[null,"space",1,1,1]
[null,"space",{"$f":"IFERROR(FIND(A194,\" \",1),0)","v":1},{"$f":"IFERROR(FIND(A194,\"1234567890\",1),0)","v":1},{"$f":"IFERROR(FIND(A194,\".,\",1),0)","v":1}]
[null,"space",1,1,1]
[null,"space",1,1,1]
[null,"space",1,1,1]
[null,"space",1,1,1]
[null,"space",1,1,1]
[null,"space",1,1,1]
[null,"space",1,1,1]
[null,"space",1,1,1]
[null,"space",1,1,1]
[null,"space",1,1,1]
[null,"space",1,1,1]
[null,"space",1,1,1]
[null,"space",1,1,1]
[null,"space",1,1,1]
[null,"space",1,1,1]
[null,"space",1,1,1]
[null,"space",1,1,1]
[null,{"$f":"IF((C212 > 0),\"space\",(IF((D212 > 0),\"num\",(IF((E212 > 0),\"punch\",\"text\")))))","v":"space"},1,1,1]
[null,"space",1,1,1]
[null,"space",1,1,1]
[null,"space",1,1,1]
[null,"space",1,1,1]
[null,"space",1,1,1]
[null,"space",1,1,1]
[null,"space",1,1,1]
[null,"space",1,1,1]
[null,"space",1,1,1]
[null,"space",1,1,1]
[null,"space",1,1,1]
[null,"space",1,1,1]
[null,"space",1,1,1]
[null,"space",1,1,1]
[null,"space",1,1,1]
[null,"space",1,1,1]
[null,"space",1,1,1]
[null,"space",1,1,1]
[null,"space",1,1,1]
[null,"space",1,1,1]
[null,"space",1,1,1]
[null,"space",1,1,1]
[null,"space",1,1,1]
[null,"space",1,1,1]
[null,"space",1,1,1]
[null,"space",1,1,1]
[null,"space",1,1,1]
[null,"space",1,1,1]
[null,"space",1,1,1]
[null,"space",1,1,1]
[null,"space",1,1,1]
[null,"space",1,1,1]
[null,"space",1,1,1]
[null,"space",1,1,1]
[null,"space",1,1,1]
[null,"space",1,1,1]
[null,"space",1,1,1]
[null,"space",1,1,1]
[null,"space",1,1,1]
[null,"space",1,1,1]
[null,"space",1,1,1]
[null,"space",1,1,1]
[null,"space",1,1,1]
[null,"space",1,1,1]
[null,"space",1,1,1]
[null,"space",{"$f":"IFERROR(FIND(A258,\" \",1),0)","v":1},{"$f":"IFERROR(FIND(A258,\"1234567890\",1),0)","v":1},{"$f":"IFERROR(FIND(A258,\".,\",1),0)","v":1}]
[null,"space",1,1,1]
[null,"space",1,1,1]
[null,"space",1,1,1]
[null,"space",1,1,1]
[null,"space",1,1,1]
[null,"space",1,1,1]
[null,"space",1,1,1]
[null,"space",1,1,1]
[null,"space",1,1,1]
[null,"space",1,1,1]
[null,"space",1,1,1]
[null,"space",1,1,1]
[null,"space",1,1,1]
[null,"space",1,1,1]
[null,"space",1,1,1]
[null,"space",1,1,1]
[null,"space",1,1,1]
[null,{"$f":"IF((C276 > 0),\"space\",(IF((D276 > 0),\"num\",(IF((E276 > 0),\"punch\",\"text\")))))","v":"space"},1,1,1]
[null,"space",1,1,1]
[null,"space",1,1,1]
[null,"space",1,1,1]
[null,"space",1,1,1]
[null,"space",1,1,1]
[null,"space",1,1,1]
[null,"space",1,1,1]
[null,"space",1,1,1]
[null,"space",1,1,1]
[null,"space",1,1,1]
[null,"space",1,1,1]
[null,"space",1,1,1]
[null,"space",1,1,1]
[null,"space",1,1,1]
[null,"space",1,1,1]
[null,"space",1,1,1]
[null,"space",1,1,1]
[null,"space",1,1,1]
[null,"space",1,1,1]
[null,"space",1,1,1]
[null,"space",1,1,1]
[null,"space",1,1,1]
[null,"space",1,1,1]
[null,"space",1,1,1]
[null,"space",1,1,1]
[null,"space",1,1,1]
[null,"space",1,1,1]
[null,"space",1,1,1]
[null,"space",1,1,1]
[null,"space",1,1,1]
[null,"space",1,1,1]
[null,"space",1,1,1]
[null,"space",1,1,1]
[null,"space",1,1,1]
[null,"space",1,1,1]
[null,"space",1,1,1]
[null,"space",1,1,1]
[null,"space",1,1,1]
[null,"space",1,1,1]
[null,"space",1,1,1]
[null,"space",1,1,1]
[null,"space",1,1,1]
[null,"space",1,1,1]
[null,"space",1,1,1]
[null,"space",1,1,1]
[null,"space",{"$f":"IFERROR(FIND(A322,\" \",1),0)","v":1},{"$f":"IFERROR(FIND(A322,\"1234567890\",1),0)","v":1},{"$f":"IFERROR(FIND(A322,\".,\",1),0)","v":1}]
[null,"space",1,1,1]
[null,"space",1,1,1]
[null,"space",1,1,1]
[null,"space",1,1,1]
[null,"space",1,1,1]
[null,"space",1,1,1]
[null,"space",1,1,1]
[null,"space",1,1,1]
[null,"space",1,1,1]
[null,"space",1,1,1]
[null,"space",1,1,1]
[null,"space",1,1,1]
[null,"space",1,1,1]
[null,"space",1,1,1]
[null,"space",1,1,1]
[null,"space",1,1,1]
[null,"space",1,1,1]
[null,{"$f":"IF((C340 > 0),\"space\",(IF((D340 > 0),\"num\",(IF((E340 > 0),\"punch\",\"text\")))))","v":"space"},1,1,1]
[null,"space",1,1,1]
[null,"space",1,1,1]
[null,"space",1,1,1]
[null,"space",1,1,1]
[null,"space",1,1,1]
[null,"space",1,1,1]
[null,"space",1,1,1]
[null,"space",1,1,1]
[null,"space",1,1,1]
[null,"space",1,1,1]
[null,"space",1,1,1]
[null,"space",1,1,1]
[null,"space",1,1,1]
[null,"space",1,1,1]
[null,"space",1,1,1]
[null,"space",1,1,1]
[null,"space",1,1,1]
[null,"space",1,1,1]
[null,"space",1,1,1]
[null,"space",1,1,1]
[null,"space",1,1,1]
[null,"space",1,1,1]
[null,"space",1,1,1]
[null,"space",1,1,1]
[null,"space",1,1,1]
[null,"space",1,1,1]
[null,"space",1,1,1]
[null,"space",1,1,1]
[null,"space",1,1,1]
[null,"space",1,1,1]
[null,"space",1,1,1]
[null,"space",1,1,1]
[null,"space",1,1,1]
[null,"space",1,1,1]
[null,"space",1,1,1]
[null,"space",1,1,1]
[null,"space",1,1,1]
[null,"space",1,1,1]
[null,"space",1,1,1]
[null,"space",1,1,1]
[null,"space",1,1,1]
[null,"space",1,1,1]
[null,"space",1,1,1]
[null,"space",1,1,1]
[null,"space",1,1,1]
[null,"space",{"$f":"IFERROR(FIND(A386,\" \",1),0)","v":1},{"$f":"IFERROR(FIND(A386,\"1234567890\",1),0)","v":1},{"$f":"IFERROR(FIND(A386,\".,\",1),0)","v":1}]
[null,"space",1,1,1]
[null,"space",1,1,1]
[null,"space",1,1,1]
[null,"space",1,1,1]
[null,"space",1,1,1]
[null,"space",1,1,1]
[null,"space",1,1,1]
[null,"space",1,1,1]
[null,"space",1,1,1]
[null,"space",1,1,1]
[null,"space",1,1,1]
[null,"space",1,1,1]
[null,"space",1,1,1]
[null,"space",1,1,1]
[null,"space",1,1,1]
[null,"space",1,1,1]
[null,"space",1,1,1]
[null,{"$f":"IF((C404 > 0),\"space\",(IF((D404 > 0),\"num\",(IF((E404 > 0),\"punch\",\"text\")))))","v":"space"},1,1,1]
[null,"space",1,1,1]
[null,"space",1,1,1]
[null,"space",1,1,1]
[null,"space",1,1,1]
[null,"space",1,1,1]
[null,"space",1,1,1]
[null,"space",1,1,1]
[null,"space",1,1,1]
[null,"space",1,1,1]
[null,"space",1,1,1]
[null,"space",1,1,1]
[null,"space",1,1,1]
[null,"space",1,1,1]
[null,"space",1,1,1]
[null,"space",1,1,1]
[null,"space",1,1,1]
[null,"space",1,1,1]
[null,"space",1,1,1]
[null,"space",1,1,1]
[null,"space",1,1,1]
[null,"space",1,1,1]
[null,"space",1,1,1]
[null,"space",1,1,1]
[null,"space",1,1,1]
[null,"space",1,1,1]
[null,"space",1,1,1]
[null,"space",1,1,1]
[null,"space",1,1,1]
[null,"space",1,1,1]
[null,"space",1,1,1]
[null,"space",1,1,1]
[null,"space",1,1,1]
[null,"space",1,1,1]
[null,"space",1,1,1]
[null,"space",1,1,1]
[null,"space",1,1,1]
[null,"space",1,1,1]
[null,"space",1,1,1]
[null,"space",1,1,1]
[null,"space",1,1,1]
[null,"space",1,1,1]
[null,"space",1,1,1]
[null,"space",1,1,1]
[null,"space",1,1,1]
[null,"space",1,1,1]
[null,"space",{"$f":"IFERROR(FIND(A450,\" \",1),0)","v":1},{"$f":"IFERROR(FIND(A450,\"1234567890\",1),0)","v":1},{"$f":"IFERROR(FIND(A450,\".,\",1),0)","v":1}]
[null,"space",1,1,1]
[null,"space",1,1,1]
[null,"space",1,1,1]
[null,"space",1,1,1]
[null,"space",1,1,1]
[null,"space",1,1,1]
[null,"space",1,1,1]
[null,"space",1,1,1]
[null,"space",1,1,1]
[null,"space",1,1,1]
[null,"space",1,1,1]
[null,"space",1,1,1]
[null,"space",1,1,1]
[null,"space",1,1,1]
[null,"space",1,1,1]
[null,"space",1,1,1]
[null,"space",1,1,1]
[null,{"$f":"IF((C468 > 0),\"space\",(IF((D468 > 0),\"num\",(IF((E468 > 0),\"punch\",\"text\")))))","v":"space"},1,1,1]
[null,"space",1,1,1]
[null,"space",1,1,1]
[null,"space",1,1,1]
[null,"space",1,1,1]
[null,"space",1,1,1]
[null,"space",1,1,1]
[null,"space",1,1,1]
[null,"space",1,1,1]
[null,"space",1,1,1]
[null,"space",1,1,1]
[null,"space",1,1,1]
[null,"space",1,1,1]
[null,"space",1,1,1]
[null,"space",1,1,1]
[null,"space",1,1,1]
[null,"space",1,1,1]
[null,"space",1,1,1]
[null,"space",1,1,1]
[null,"space",1,1,1]
[null,"space",1,1,1]
[null,"space",1,1,1]
[null,"space",1,1,1]
[null,"space",1,1,1]
[null,"space",1,1,1]
[null,"space",1,1,1]
[null,"space",1,1,1]
[null,"space",1,1,1]
[null,"space",1,1,1]
[null,"space",1,1,1]
[null,"space",1,1,1]
[null,"space",1,1,1]
[null,"space",1,1,1]
[null,"space",1,1,1]
[null,"space",1,1,1]
[null,"space",1,1,1]
[null,"space",1,1,1]
[null,"space",1,1,1]
[null,"space",1,1,1]
[null,"space",1,1,1]
[null,"space",1,1,1]
[null,"space",1,1,1]
[null,"space",1,1,1]
[null,"space",1,1,1]
[null,"space",1,1,1]
[null,"space",1,1,1]
[null,"space",{"$f":"IFERROR(FIND(A514,\" \",1),0)","v":1},{"$f":"IFERROR(FIND(A514,\"1234567890\",1),0)","v":1},{"$f":"IFERROR(FIND(A514,\".,\",1),0)","v":1}]
[null,"space",1,1,1]
[null,"space",1,1,1]
[null,"space",1,1,1]
[null,"space",1,1,1]
[null,"space",1,1,1]
[null,"space",1,1,1]
[null,"space",1,1,1]
[null,"space",1,1,1]
[null,"space",1,1,1]
[null,"space",1,1,1]
[null,"space",1,1,1]
[null,"space",1,1,1]
[null,"space",1,1,1]
[null,"space",1,1,1]
[null,"space",1,1,1]
[null,"space",1,1,1]
[null,"space",1,1,1]
[null,{"$f":"IF((C532 > 0),\"space\",(IF((D532 > 0),\"num\",(IF((E532 > 0),\"punch\",\"text\")))))","v":"space"},1,1,1]
[null,"space",1,1,1]
[null,"space",1,1,1]
[null,"space",1,1,1]
[null,"space",1,1,1]
[null,"space",1,1,1]
[null,"space",1,1,1]
[null,"space",1,1,1]
[null,"space",1,1,1]
[null,"space",1,1,1]
[null,"space",1,1,1]
[null,"space",1,1,1]
[null,"space",1,1,1]
[null,"space",1,1,1]
[null,"space",1,1,1]
[null,"space",1,1,1]
[null,"space",1,1,1]
[null,"space",1,1,1]
[null,"space",1,1,1]
[null,"space",1,1,1]
[null,"space",1,1,1]
[null,"space",1,1,1]
[null,"space",1,1,1]
[null,"space",1,1,1]
[null,"space",1,1,1]
[null,"space",1,1,1]
[null,"space",1,1,1]
[null,"space",1,1,1]
[null,"space",1,1,1]
[null,"space",1,1,1]
[null,"space",1,1,1]
[null,"space",1,1,1]
[null,"space",1,1,1]
[null,"space",1,1,1]
[null,"space",1,1,1]
[null,"space",1,1,1]
[null,"space",1,1,1]
[null,"space",1,1,1]
[null,"space",1,1,1]
[null,"space",1,1,1]
[null,"space",1,1,1]
[null,"space",1,1,1]
[null,"space",1,1,1]
[null,"space",1,1,1]
[null,"space",1,1,1]
[null,"space",1,1,1]
[null,"space",{"$f":"IFERROR(FIND(A578,\" \",1),0)","v":1},{"$f":"IFERROR(FIND(A578,\"1234567890\",1),0)","v":1},{"$f":"IFERROR(FIND(A578,\".,\",1),0)","v":1}]
[null,"space",1,1,1]
[null,"space",1,1,1]
[null,"space",1,1,1]
[null,"space",1,1,1]
[null,"space",1,1,1]
[null,"space",1,1,1]
[null,"space",1,1,1]
[null,"space",1,1,1]
[null,"space",1,1,1]
[null,"space",1,1,1]
[null,"space",1,1,1]
[null,"space",1,1,1]
[null,"space",1,1,1]
[null,"space",1,1,1]
[null,"space",1,1,1]
[null,"space",1,1,1]
[null,"space",1,1,1]
[null,{"$f":"IF((C596 > 0),\"space\",(IF((D596 > 0),\"num\",(IF((E596 > 0),\"punch\",\"text\")))))","v":"space"},1,1,1]
[null,"space",1,1,1]
[null,"space",1,1,1]
[null,"space",1,1,1]
[null,"space",1,1,1]
[null,"space",1,1,1]
[null,"space",1,1,1]
[null,"space",1,1,1]
[null,"space",1,1,1]
[null,"space",1,1,1]
[null,"space",1,1,1]
[null,"space",1,1,1]
[null,"space",1,1,1]
[null,"space",1,1,1]
[null,"space",1,1,1]
[null,"space",1,1,1]
[null,"space",1,1,1]
[null,"space",1,1,1]
[null,"space",1,1,1]
[null,"space",1,1,1]
[null,"space",1,1,1]
[null,"space",1,1,1]
[null,"space",1,1,1]
[null,"space",1,1,1]
[null,"space",1,1,1]
[null,"space",1,1,1]
[null,"space",1,1,1]
[null,"space",1,1,1]
[null,"space",1,1,1]
[null,"space",1,1,1]
[null,"space",1,1,1]
[null,"space",1,1,1]
[null,"space",1,1,1]
[null,"space",1,1,1]
[null,"space",1,1,1]
[null,"space",1,1,1]
[null,"space",1,1,1]
[null,"space",1,1,1]
[null,"space",1,1,1]
[null,"space",1,1,1]
[null,"space",1,1,1]
[null,"space",1,1,1]
[null,"space",1,1,1]
[null,"space",1,1,1]
[null,"space",1,1,1]
[null,"space",1,1,1]
[null,"space",{"$f":"IFERROR(FIND(A642,\" \",1),0)","v":1},{"$f":"IFERROR(FIND(A642,\"1234567890\",1),0)","v":1},{"$f":"IFERROR(FIND(A642,\".,\",1),0)","v":1}]
[null,"space",1,1,1]
[null,"space",1,1,1]
[null,"space",1,1,1]
[null,"space",1,1,1]
[null,"space",1,1,1]
[null,"space",1,1,1]
[null,"space",1,1,1]
[null,"space",1,1,1]
[null,"space",1,1,1]
[null,"space",1,1,1]
[null,"space",1,1,1]
[null,"space",1,1,1]
[null,"space",1,1,1]
[null,"space",1,1,1]
[null,"space",1,1,1]
[null,"space",1,1,1]
[null,"space",1,1,1]
[null,{"$f":"IF((C660 > 0),\"space\",(IF((D660 > 0),\"num\",(IF((E660 > 0),\"punch\",\"text\")))))","v":"space"},1,1,1]
[null,"space",1,1,1]
[null,"space",1,1,1]
[null,"space",1,1,1]
[null,"space",1,1,1]
[null,"space",1,1,1]
[null,"space",1,1,1]
[null,"space",1,1,1]
[null,"space",1,1,1]
[null,"space",1,1,1]
[null,"space",1,1,1]
[null,"space",1,1,1]
[null,"space",1,1,1]
[null,"space",1,1,1]
[null,"space",1,1,1]
[null,"space",1,1,1]
[null,"space",1,1,1]
[null,"space",1,1,1]
[null,"space",1,1,1]
[null,"space",1,1,1]
[null,"space",1,1,1]
[null,"space",1,1,1]
[null,"space",1,1,1]
[null,"space",1,1,1]
[null,"space",1,1,1]
[null,"space",1,1,1]
[null,"space",1,1,1]
[null,"space",1,1,1]
[null,"space",1,1,1]
[null,"space",1,1,1]
[null,"space",1,1,1]
[null,"space",1,1,1]
[null,"space",1,1,1]
[null,"space",1,1,1]
[null,"space",1,1,1]
[null,"space",1,1,1]
[null,"space",1,1,1]
[null,"space",1,1,1]
[null,"space",1,1,1]
[null,"space",1,1,1]
[null,"space",1,1,1]
[null,"space",1,1,1]
[null,"space",1,1,1]
[null,"space",1,1,1]
[null,"space",1,1,1]
[null,"space",1,1,1]
[null,"space",{"$f":"IFERROR(FIND(A706,\" \",1),0)","v":1},{"$f":"IFERROR(FIND(A706,\"1234567890\",1),0)","v":1},{"$f":"IFERROR(FIND(A706,\".,\",1),0)","v":1}]
[null,"space",1,1,1]
[null,"space",1,1,1]
[null,"space",1,1,1]
[null,"space",1,1,1]
[null,"space",1,1,1]
[null,"space",1,1,1]
[null,"space",1,1,1]
[null,"space",1,1,1]
[null,"space",1,1,1]
[null,"space",1,1,1]
[null,"space",1,1,1]
[null,"space",1,1,1]
[null,"space",1,1,1]
[null,"space",1,1,1]
[null,"space",1,1,1]
[null,"space",1,1,1]
[null,"space",1,1,1]
[null,{"$f":"IF((C724 > 0),\"space\",(IF((D724 > 0),\"num\",(IF((E724 > 0),\"punch\",\"text\")))))","v":"space"},1,1,1]
[null,"space",1,1,1]
[null,"space",1,1,1]
[null,"space",1,1,1]
[null,"space",1,1,1]
[null,"space",1,1,1]
[null,"space",1,1,1]
[null,"space",1,1,1]
[null,"space",1,1,1]
[null,"space",1,1,1]
[null,"space",1,1,1]
[null,"space",1,1,1]
[null,"space",1,1,1]
[null,"space",1,1,1]
[null,"space",1,1,1]
[null,"space",1,1,1]
[null,"space",1,1,1]
[null,"space",1,1,1]
[null,"space",1,1,1]
[null,"space",1,1,1]
[null,"space",1,1,1]
[null,"space",1,1,1]
[null,"space",1,1,1]
[null,"space",1,1,1]
[null,"space",1,1,1]
[null,"space",1,1,1]
[null,"space",1,1,1]
[null,"space",1,1,1]
[null,"space",1,1,1]
[null,"space",1,1,1]
[null,"space",1,1,1]
[null,"space",1,1,1]
[null,"space",1,1,1]
[null,"space",1,1,1]
[null,"space",1,1,1]
[null,"space",1,1,1]
[null,"space",1,1,1]
[null,"space",1,1,1]
[null,"space",1,1,1]
[null,"space",1,1,1]
[null,"space",1,1,1]
[null,"space",1,1,1]
[null,"space",1,1,1]
[null,"space",1,1,1]
[null,"space",1,1,1]
[null,"space",1,1,1]
[null,"space",{"$f":"IFERROR(FIND(A770,\" \",1),0)","v":1},{"$f":"IFERROR(FIND(A770,\"1234567890\",1),0)","v":1},{"$f":"IFERROR(FIND(A770,\".,\",1),0)","v":1}]
[null,"space",1,1,1]
[null,"space",1,1,1]
[null,"space",1,1,1]
[null,"space",1,1,1]
[null,"space",1,1,1]
[null,"space",1,1,1]
[null,"space",1,1,1]
[null,"space",1,1,1]
[null,"space",1,1,1]
[null,"space",1,1,1]
[null,"space",1,1,1]
[null,"space",1,1,1]
[null,"space",1,1,1]
[null,"space",1,1,1]
[null,"space",1,1,1]
[null,"space",1,1,1]
[null,"space",1,1,1]
[null,{"$f":"IF((C788 > 0),\"space\",(IF((D788 > 0),\"num\",(IF((E788 > 0),\"punch\",\"text\")))))","v":"space"},1,1,1]
[null,"space",1,1,1]
[null,"space",1,1,1]
[null,"space",1,1,1]
[null,"space",1,1,1]
[null,"space",1,1,1]
[null,"space",1,1,1]
[null,"space",1,1,1]
[null,"space",1,1,1]
[null,"space",1,1,1]
[null,"space",1,1,1]
[null,"space",1,1,1]
[null,"space",1,1,1]
[null,"space",1,1,1]
[null,"space",1,1,1]
[null,"space",1,1,1]
[null,"space",1,1,1]
[null,"space",1,1,1]
[null,"space",1,1,1]
[null,"space",1,1,1]
[null,"space",1,1,1]
[null,"space",1,1,1]
[null,"space",1,1,1]
[null,"space",1,1,1]
[null,"space",1,1,1]
[null,"space",1,1,1]
[null,"space",1,1,1]
[null,"space",1,1,1]
[null,"space",1,1,1]
[null,"space",1,1,1]
[null,"space",1,1,1]
[null,"space",1,1,1]
[null,"space",1,1,1]
[null,"space",1,1,1]
[null,"space",1,1,1]
[null,"space",1,1,1]
[null,"space",1,1,1]
[null,"space",1,1,1]
[null,"space",1,1,1]
[null,"space",1,1,1]
[null,"space",1,1,1]
[null,"space",1,1,1]
[null,"space",1,1,1]
[null,"space",1,1,1]
[null,"space",1,1,1]
[null,"space",1,1,1]
[null,"space",{"$f":"IFERROR(FIND(A834,\" \",1),0)","v":1},{"$f":"IFERROR(FIND(A834,\"1234567890\",1),0)","v":1},{"$f":"IFERROR(FIND(A834,\".,\",1),0)","v":1}]
[null,"space",1,1,1]
[null,"space",1,1,1]
[null,"space",1,1,1]
[null,"space",1,1,1]
[null,"space",1,1,1]
[null,"space",1,1,1]
[null,"space",1,1,1]
[null,"space",1,1,1]
[null,"space",1,1,1]
[null,"space",1,1,1]
[null,"space",1,1,1]
[null,"space",1,1,1]
[null,"space",1,1,1]
[null,"space",1,1,1]
[null,"space",1,1,1]
[null,"space",1,1,1]
[null,"space",1,1,1]
[null,{"$f":"IF((C852 > 0),\"space\",(IF((D852 > 0),\"num\",(IF((E852 > 0),\"punch\",\"text\")))))","v":"space"},1,1,1]
[null,"space",1,1,1]
[null,"space",1,1,1]
[null,"space",1,1,1]
[null,"space",1,1,1]
[null,"space",1,1,1]
[null,"space",1,1,1]
[null,"space",1,1,1]
[null,"space",1,1,1]
[null,"space",1,1,1]
[null,"space",1,1,1]
[null,"space",1,1,1]
[null,"space",1,1,1]
[null,"space",1,1,1]
[null,"space",1,1,1]
[null,"space",1,1,1]
[null,"space",1,1,1]
[null,"space",1,1,1]
[null,"space",1,1,1]
[null,"space",1,1,1]
[null,"space",1,1,1]
[null,"space",1,1,1]
[null,"space",1,1,1]
[null,"space",1,1,1]
[null,"space",1,1,1]
[null,"space",1,1,1]
[null,"space",1,1,1]
[null,"space",1,1,1]
[null,"space",1,1,1]
[null,"space",1,1,1]
[null,"space",1,1,1]
[null,"space",1,1,1]
[null,"space",1,1,1]
[null,"space",1,1,1]
[null,"space",1,1,1]
[null,"space",1,1,1]
[null,"space",1,1,1]
[null,"space",1,1,1]
[null,"space",1,1,1]
[null,"space",1,1,1]
[null,"space",1,1,1]
[null,"space",1,1,1]
[null,"space",1,1,1]
[null,"space",1,1,1]
[null,"space",1,1,1]
[null,"space",1,1,1]
[null,"space",{"$f":"IFERROR(FIND(A898,\" \",1),0)","v":1},{"$f":"IFERROR(FIND(A898,\"1234567890\",1),0)","v":1},{"$f":"IFERROR(FIND(A898,\".,\",1),0)","v":1}]
[null,"space",1,1,1]
[null,"space",1,1,1]
[null,"space",1,1,1]
[null,"space",1,1,1]
[null,"space",1,1,1]
[null,"space",1,1,1]
[null,"space",1,1,1]
[null,"space",1,1,1]
[null,"space",1,1,1]
[null,"space",1,1,1]
[null,"space",1,1,1]
[null,"space",1,1,1]
[null,"space",1,1,1]
[null,"space",1,1,1]
[null,"space",1,1,1]
[null,"space",1,1,1]
[null,"space",1,1,1]
[null,{"$f":"IF((C916 > 0),\"space\",(IF((D916 > 0),\"num\",(IF((E916 > 0),\"punch\",\"text\")))))","v":"space"},1,1,1]
[null,"space",1,1,1]
[null,"space",1,1,1]
[null,"space",1,1,1]
[null,"space",1,1,1]
[null,"space",1,1,1]
[null,"space",1,1,1]
[null,"space",1,1,1]
[null,"space",1,1,1]
[null,"space",1,1,1]
[null,"space",1,1,1]
[null,"space",1,1,1]
[null,"space",1,1,1]
[null,"space",1,1,1]
[null,"space",1,1,1]
[null,"space",1,1,1]
[null,"space",1,1,1]
[null,"space",1,1,1]
[null,"space",1,1,1]
[null,"space",1,1,1]
[null,"space",1,1,1]
[null,"space",1,1,1]
[null,"space",1,1,1]
[null,"space",1,1,1]
[null,"space",1,1,1]
[null,"space",1,1,1]
[null,"space",1,1,1]
[null,"space",1,1,1]
[null,"space",1,1,1]
[null,"space",1,1,1]
[null,"space",1,1,1]
[null,"space",1,1,1]
[null,"space",1,1,1]
[null,"space",1,1,1]
[null,"space",1,1,1]
[null,"space",1,1,1]
[null,"space",1,1,1]
[null,"space",1,1,1]
[null,"space",1,1,1]
[null,"space",1,1,1]
[null,"space",1,1,1]
[null,"space",1,1,1]
[null,"space",1,1,1]
[null,"space",1,1,1]
[null,"space",1,1,1]
[null,"space",1,1,1]
[null,"space",{"$f":"IFERROR(FIND(A962,\" \",1),0)","v":1},{"$f":"IFERROR(FIND(A962,\"1234567890\",1),0)","v":1},{"$f":"IFERROR(FIND(A962,\".,\",1),0)","v":1}]
[null,"space",1,1,1]
[null,"space",1,1,1]
[null,"space",1,1,1]
[null,"space",1,1,1]
[null,"space",1,1,1]
[null,"space",1,1,1]
[null,"space",1,1,1]
[null,"space",1,1,1]
[null,"space",1,1,1]
[null,"space",1,1,1]
[null,"space",1,1,1]
[null,"space",1,1,1]
[null,"space",1,1,1]
[null,"space",1,1,1]
[null,"space",1,1,1]
[null,"space",1,1,1]
[null,"space",1,1,1]
[null,{"$f":"IF((C980 > 0),\"space\",(IF((D980 > 0),\"num\",(IF((E980 > 0),\"punch\",\"text\")))))","v":"space"},1,1,1]
[null,"space",1,1,1]
[null,"space",1,1,1]
[null,"space",1,1,1]
[null,"space",1,1,1]
[null,"space",1,1,1]
[null,"space",1,1,1]
[null,"space",1,1,1]
[null,"space",1,1,1]
[null,"space",1,1,1]
[null,"space",1,1,1]
[null,"space",1,1,1]
[null,"space",1,1,1]
[null,"space",1,1,1]
[null,"space",1,1,1]
[null,"space",1,1,1]
[null,"space",1,1,1]
[null,"space",1,1,1]
[null,"space",1,1,1]
[null,"space",1,1,1]
[null,"space",1,1,1]
[null,"space",1,1,1]
[null,"space",1,1,1]
[null,"space",1,1,1]
[null,"space",1,1,1]
[null,"space",1,1,1]
[null,"space",1,1,1]
[null,"space",1,1,1]
[null,"space",1,1,1]
[null,"space",1,1,1]
[null,"space",1,1,1]
[null,"space",1,1,1]
[null,"space",1,1,1]
[null,"space",1,1,1]
[null,"space",1,1,1]
[null,"space",1,1,1]
[null,"space",1,1,1]
[null,"space",1,1,1]
[null,"space",1,1,1]
[null,"space",1,1,1]
[null,"space",1,1,1]
[null,"space",1,1,1]
[null,"space",1,1,1]
[null,"space",1,1,1]
[null,"space",1,1,1]
[null,"space",1,1,1]
[null,"space",{"$f":"IFERROR(FIND(A1026,\" \",1),0)","v":1},{"$f":"IFERROR(FIND(A1026,\"1234567890\",1),0)","v":1},{"$f":"IFERROR(FIND(A1026,\".,\",1),0)","v":1}]
[null,"space",1,1,1]
[null,"space",1,1,1]
[null,"space",1,1,1]
[null,"space",1,1,1]
[null,"space",1,1,1]
[null,"space",1,1,1]
[null,"space",1,1,1]
[null,"space",1,1,1]
[null,"space",1,1,1]
[null,"space",1,1,1]
[null,"space",1,1,1]
[null,"space",1,1,1]
[null,"space",1,1,1]
[null,"space",1,1,1]
[null,"space",1,1,1]
[null,"space",1,1,1]
[null,"space",1,1,1]
[null,{"$f":"IF((C1044 > 0),\"space\",(IF((D1044 > 0),\"num\",(IF((E1044 > 0),\"punch\",\"text\")))))","v":"space"},1,1,1]
[null,"space",1,1,1]
[null,"space",1,1,1]
[null,"space",1,1,1]
[null,"space",1,1,1]
[null,"space",1,1,1]
[null,"space",1,1,1]
[null,"space",1,1,1]
[null,"space",1,1,1]
[null,"space",1,1,1]
[null,"space",1,1,1]
[null,"space",1,1,1]
[null,"space",1,1,1]
[null,"space",1,1,1]
[null,"space",1,1,1]
[null,"space",1,1,1]
[null,"space",1,1,1]
[null,"space",1,1,1]
[null,"space",1,1,1]
[null,"space",1,1,1]
[null,"space",1,1,1]
[null,"space",1,1,1]
[null,"space",1,1,1]
[null,"space",1,1,1]
[null,"space",1,1,1]
[null,"space",1,1,1]
[null,"space",1,1,1]
[null,"space",1,1,1]
[null,"space",1,1,1]
[null,"space",1,1,1]
[null,"space",1,1,1]
[null,"space",1,1,1]
[null,"space",1,1,1]
[null,"space",1,1,1]
[null,"space",1,1,1]
[null,"space",1,1,1]
[null,"space",1,1,1]
[null,"space",1,1,1]
[null,"space",1,1,1]
[null,"space",1,1,1]
[null,"space",1,1,1]
[null,"space",1,1,1]
[null,"space",1,1,1]
[null,"space",1,1,1]
[null,"space",1,1,1]
[null,"space",1,1,1]
[null,"space",{"$f":"IFERROR(FIND(A1090,\" \",1),0)","v":1},{"$f":"IFERROR(FIND(A1090,\"1234567890\",1),0)","v":1},{"$f":"IFERROR(FIND(A1090,\".,\",1),0)","v":1}]
[null,"space",1,1,1]
[null,"space",1,1,1]
[null,"space",1,1,1]
[null,"space",1,1,1]
[null,"space",1,1,1]
[null,"space",1,1,1]
[null,"space",1,1,1]
[null,"space",1,1,1]
[null,"space",1,1,1]
[null,"space",1,1,1]
[null,"space",1,1,1]
[null,"space",1,1,1]
[null,"space",1,1,1]
[null,"space",1,1,1]
[null,"space",1,1,1]
[null,"space",1,1,1]
[null,"space",1,1,1]
[null,{"$f":"IF((C1108 > 0),\"space\",(IF((D1108 > 0),\"num\",(IF((E1108 > 0),\"punch\",\"text\")))))","v":"space"},1,1,1]
[null,"space",1,1,1]
[null,"space",1,1,1]
[null,"space",1,1,1]
[null,"space",1,1,1]
[null,"space",1,1,1]
[null,"space",1,1,1]
[null,"space",1,1,1]
[null,"space",1,1,1]
[null,"space",1,1,1]
[null,"space",1,1,1]
[null,"space",1,1,1]
[null,"space",1,1,1]
[null,"space",1,1,1]
[null,"space",1,1,1]
[null,"space",1,1,1]
[null,"space",1,1,1]
[null,"space",1,1,1]
[null,"space",1,1,1]
[null,"space",1,1,1]
[null,"space",1,1,1]
[null,"space",1,1,1]
[null,"space",1,1,1]
[null,"space",1,1,1]
[null,"space",1,1,1]
[null,"space",1,1,1]
[null,"space",1,1,1]
[null,"space",1,1,1]
[null,"space",1,1,1]
[null,"space",1,1,1]
[null,"space",1,1,1]
[null,"space",1,1,1]
[null,"space",1,1,1]
[null,"space",1,1,1]
[null,"space",1,1,1]
[null,"space",1,1,1]
[null,"space",1,1,1]
[null,"space",1,1,1]
[null,"space",1,1,1]
[null,"space",1,1,1]
[null,"space",1,1,1]
[null,"space",1,1,1]
[null,"space",1,1,1]
[null,"space",1,1,1]
[null,"space",1,1,1]
[null,"space",1,1,1]
[null,"space",{"$f":"IFERROR(FIND(A1154,\" \",1),0)","v":1},{"$f":"IFERROR(FIND(A1154,\"1234567890\",1),0)","v":1},{"$f":"IFERROR(FIND(A1154,\".,\",1),0)","v":1}]
[null,"space",1,1,1]
[null,"space",1,1,1]
[null,"space",1,1,1]
[null,"space",1,1,1]
[null,"space",1,1,1]
[null,"space",1,1,1]
[null,"space",1,1,1]
[null,"space",1,1,1]
[null,"space",1,1,1]
[null,"space",1,1,1]
[null,"space",1,1,1]
[null,"space",1,1,1]
[null,"space",1,1,1]
[null,"space",1,1,1]
[null,"space",1,1,1]
[null,"space",1,1,1]
[null,"space",1,1,1]
[null,{"$f":"IF((C1172 > 0),\"space\",(IF((D1172 > 0),\"num\",(IF((E1172 > 0),\"punch\",\"text\")))))","v":"space"},1,1,1]
[null,"space",1,1,1]
[null,"space",1,1,1]
[null,"space",1,1,1]
[null,"space",1,1,1]
[null,"space",1,1,1]
[null,"space",1,1,1]
[null,"space",1,1,1]
[null,"space",1,1,1]
[null,"space",1,1,1]
[null,"space",1,1,1]
[null,"space",1,1,1]
[null,"space",1,1,1]
[null,"space",1,1,1]
[null,"space",1,1,1]
[null,"space",1,1,1]
[null,"space",1,1,1]
[null,"space",1,1,1]
[null,"space",1,1,1]
[null,"space",1,1,1]
[null,"space",1,1,1]
[null,"space",1,1,1]
[null,"space",1,1,1]
[null,"space",1,1,1]
[null,"space",1,1,1]
[null,"space",1,1,1]
[null,"space",1,1,1]
[null,"space",1,1,1]
[null,"space",1,1,1]
[null,"space",1,1,1]
[null,"space",1,1,1]
[null,"space",1,1,1]
[null,"space",1,1,1]
[null,"space",1,1,1]
[null,"space",1,1,1]
[null,"space",1,1,1]
[null,"space",1,1,1]
[null,"space",1,1,1]
[null,"space",1,1,1]
[null,"space",1,1,1]
[null,"space",1,1,1]
[null,"space",1,1,1]
[null,"space",1,1,1]
[null,"space",1,1,1]
[null,"space",1,1,1]
[null,"space",1,1,1]
[null,"space",{"$f":"IFERROR(FIND(A1218,\" \",1),0)","v":1},{"$f":"IFERROR(FIND(A1218,\"1234567890\",1),0)","v":1},{"$f":"IFERROR(FIND(A1218,\".,\",1),0)","v":1}]
[null,"space",1,1,1]
[null,"space",1,1,1]
[null,"space",1,1,1]
[null,"space",1,1,1]
[null,"space",1,1,1]
[null,"space",1,1,1]
[null,"space",1,1,1]
[null,"space",1,1,1]
[null,"space",1,1,1]
[null,"space",1,1,1]
[null,"space",1,1,1]
[null,"space",1,1,1]
[null,"space",1,1,1]
[null,"space",1,1,1]
[null,"space",1,1,1]
[null,"space",1,1,1]
[null,"space",1,1,1]
[null,{"$f":"IF((C1236 > 0),\"space\",(IF((D1236 > 0),\"num\",(IF((E1236 > 0),\"punch\",\"text\")))))","v":"space"},1,1,1]
[null,"space",1,1,1]
[null,"space",1,1,1]
[null,"space",1,1,1]
[null,"space",1,1,1]
[null,"space",1,1,1]
[null,"space",1,1,1]
[null,"space",1,1,1]
[null,"space",1,1,1]
[null,"space",1,1,1]
[null,"space",1,1,1]
[null,"space",1,1,1]
[null,"space",1,1,1]
[null,"space",1,1,1]
[null,"space",1,1,1]
[null,"space",1,1,1]
[null,"space",1,1,1]
[null,"space",1,1,1]
[null,"space",1,1,1]
[null,"space",1,1,1]
[null,"space",1,1,1]
[null,"space",1,1,1]
[null,"space",1,1,1]
[null,"space",1,1,1]
[null,"space",1,1,1]
[null,"space",1,1,1]
[null,"space",1,1,1]
[null,"space",1,1,1]
[null,"space",1,1,1]
[null,"space",1,1,1]
[null,"space",1,1,1]
[null,"space",1,1,1]
[null,"space",1,1,1]
[null,"space",1,1,1]
[null,"space",1,1,1]
[null,"space",1,1,1]
[null,"space",1,1,1]
[null,"space",1,1,1]
[null,"space",1,1,1]
[null,"space",1,1,1]
[null,"space",1,1,1]
[null,"space",1,1,1]
[null,"space",1,1,1]
[null,"space",1,1,1]
[null,"space",1,1,1]
[null,"space",1,1,1]
[null,"space",{"$f":"IFERROR(FIND(A1282,\" \",1),0)","v":1},{"$f":"IFERROR(FIND(A1282,\"1234567890\",1),0)","v":1},{"$f":"IFERROR(FIND(A1282,\".,\",1),0)","v":1}]
[null,"space",1,1,1]
[null,"space",1,1,1]
[null,"space",1,1,1]
[null,"space",1,1,1]
[null,"space",1,1,1]
[null,"space",1,1,1]
[null,"space",1,1,1]
[null,"space",1,1,1]
[null,"space",1,1,1]
[null,"space",1,1,1]
[null,"space",1,1,1]
[null,"space",1,1,1]
[null,"space",1,1,1]
[null,"space",1,1,1]
[null,"space",1,1,1]
[null,"space",1,1,1]
[null,"space",1,1,1]
[null,{"$f":"IF((C1300 > 0),\"space\",(IF((D1300 > 0),\"num\",(IF((E1300 > 0),\"punch\",\"text\")))))","v":"space"},1,1,1]
[null,"space",1,1,1]
[null,"space",1,1,1]
[null,"space",1,1,1]
[null,"space",1,1,1]
[null,"space",1,1,1]
[null,"space",1,1,1]
[null,"space",1,1,1]
[null,"space",1,1,1]
[null,"space",1,1,1]
[null,"space",1,1,1]
[null,"space",1,1,1]
[null,"space",1,1,1]
[null,"space",1,1,1]
[null,"space",1,1,1]
[null,"space",1,1,1]
[null,"space",1,1,1]
[null,"space",1,1,1]
[null,"space",1,1,1]
[null,"space",1,1,1]
[null,"space",1,1,1]
[null,"space",1,1,1]
[null,"space",1,1,1]
[null,"space",1,1,1]
[null,"space",1,1,1]
[null,"space",1,1,1]
[null,"space",1,1,1]
[null,"space",1,1,1]
[null,"space",1,1,1]
[null,"space",1,1,1]
[null,"space",1,1,1]
[null,"space",1,1,1]
[null,"space",1,1,1]
[null,"space",1,1,1]
[null,"space",1,1,1]
[null,"space",1,1,1]
[null,"space",1,1,1]
[null,"space",1,1,1]
[null,"space",1,1,1]
[null,"space",1,1,1]
[null,"space",1,1,1]
[null,"space",1,1,1]
[null,"space",1,1,1]
[null,"space",1,1,1]
[null,"space",1,1,1]
[null,"space",1,1,1]
[null,"space",{"$f":"IFERROR(FIND(A1346,\" \",1),0)","v":1},{"$f":"IFERROR(FIND(A1346,\"1234567890\",1),0)","v":1},{"$f":"IFERROR(FIND(A1346,\".,\",1),0)","v":1}]
[null,"space",1,1,1]
[null,"space",1,1,1]
[null,"space",1,1,1]
[null,"space",1,1,1]
[null,"space",1,1,1]
[null,"space",1,1,1]
[null,"space",1,1,1]
[null,"space",1,1,1]
[null,"space",1,1,1]
[null,"space",1,1,1]
[null,"space",1,1,1]
[null,"space",1,1,1]
[null,"space",1,1,1]
[null,"space",1,1,1]
[null,"space",1,1,1]
[null,"space",1,1,1]
[null,"space",1,1,1]
[null,{"$f":"IF((C1364 > 0),\"space\",(IF((D1364 > 0),\"num\",(IF((E1364 > 0),\"punch\",\"text\")))))","v":"space"},1,1,1]
[null,"space",1,1,1]
[null,"space",1,1,1]
[null,"space",1,1,1]
[null,"space",1,1,1]
[null,"space",1,1,1]
[null,"space",1,1,1]
[null,"space",1,1,1]
[null,"space",1,1,1]
[null,"space",1,1,1]
[null,"space",1,1,1]
[null,"space",1,1,1]
[null,"space",1,1,1]
[null,"space",1,1,1]
[null,"space",1,1,1]
[null,"space",1,1,1]
[null,"space",1,1,1]
[null,"space",1,1,1]
[null,"space",1,1,1]
[null,"space",1,1,1]
[null,"space",1,1,1]
[null,"space",1,1,1]
[null,"space",1,1,1]
[null,"space",1,1,1]
[null,"space",1,1,1]
[null,"space",1,1,1]
[null,"space",1,1,1]
[null,"space",1,1,1]
[null,"space",1,1,1]
[null,"space",1,1,1]
[null,"space",1,1,1]
[null,"space",1,1,1]
[null,"space",1,1,1]
[null,"space",1,1,1]
[null,"space",1,1,1]
[null,"space",1,1,1]
[null,"space",1,1,1]
[null,"space",1,1,1]
[null,"space",1,1,1]
[null,"space",1,1,1]
[null,"space",1,1,1]
[null,"space",1,1,1]
[null,"space",1,1,1]
[null,"space",1,1,1]
[null,"space",1,1,1]
[null,"space",1,1,1]
[null,"space",{"$f":"IFERROR(FIND(A1410,\" \",1),0)","v":1},{"$f":"IFERROR(FIND(A1410,\"1234567890\",1),0)","v":1},{"$f":"IFERROR(FIND(A1410,\".,\",1),0)","v":1}]
[null,"space",1,1,1]
[null,"space",1,1,1]
[null,"space",1,1,1]
[null,"space",1,1,1]
[null,"space",1,1,1]
[null,"space",1,1,1]
[null,"space",1,1,1]
[null,"space",1,1,1]
[null,"space",1,1,1]
[null,"space",1,1,1]
[null,"space",1,1,1]
[null,"space",1,1,1]
[null,"space",1,1,1]
[null,"space",1,1,1]
[null,"space",1,1,1]
[null,"space",1,1,1]
[null,"space",1,1,1]
[null,{"$f":"IF((C1428 > 0),\"space\",(IF((D1428 > 0),\"num\",(IF((E1428 > 0),\"punch\",\"text\")))))","v":"space"},1,1,1]
[null,"space",1,1,1]
[null,"space",1,1,1]
[null,"space",1,1,1]
[null,"space",1,1,1]
[null,"space",1,1,1]
[null,"space",1,1,1]
[null,"space",1,1,1]
[null,"space",1,1,1]
[null,"space",1,1,1]
[null,"space",1,1,1]
[null,"space",1,1,1]
[null,"space",1,1,1]
[null,"space",1,1,1]
[null,"space",1,1,1]
[null,"space",1,1,1]
[null,"space",1,1,1]
[null,"space",1,1,1]
[null,"space",1,1,1]
[null,"space",1,1,1]
[null,"space",1,1,1]
[null,"space",1,1,1]
[null,"space",1,1,1]
[null,"space",1,1,1]
[null,"space",1,1,1]
[null,"space",1,1,1]
[null,"space",1,1,1]
[null,"space",1,1,1]
[null,"space",1,1,1]
[null,"space",1,1,1]
[null,"space",1,1,1]
[null,"space",1,1,1]
[null,"space",1,1,1]
[null,"space",1,1,1]
[null,"space",1,1,1]
[null,"space",1,1,1]
[null,"space",1,1,1]
[null,"space",1,1,1]
[null,"space",1,1,1]
[null,"space",1,1,1]
[null,"space",1,1,1]
[null,"space",1,1,1]
[null,"space",1,1,1]
[null,"space",1,1,1]
[null,"space",1,1,1]
[null,"space",1,1,1]
[null,"space",{"$f":"IFERROR(FIND(A1474,\" \",1),0)","v":1},{"$f":"IFERROR(FIND(A1474,\"1234567890\",1),0)","v":1},{"$f":"IFERROR(FIND(A1474,\".,\",1),0)","v":1}]
[null,"space",1,1,1]
[null,"space",1,1,1]
[null,"space",1,1,1]
[null,"space",1,1,1]
[null,"space",1,1,1]
[null,"space",1,1,1]
[null,"space",1,1,1]
[null,"space",1,1,1]
[null,"space",1,1,1]
[null,"space",1,1,1]
[null,"space",1,1,1]
[null,"space",1,1,1]
[null,"space",1,1,1]
[null,"space",1,1,1]
[null,"space",1,1,1]
[null,"space",1,1,1]
[null,"space",1,1,1]
[null,{"$f":"IF((C1492 > 0),\"space\",(IF((D1492 > 0),\"num\",(IF((E1492 > 0),\"punch\",\"text\")))))","v":"space"},1,1,1]
[null,"space",1,1,1]
[null,"space",1,1,1]
[null,"space",1,1,1]
[null,"space",1,1,1]
[null,"space",1,1,1]
[null,"space",1,1,1]
[null,"space",1,1,1]
[null,"space",1,1,1]
[null,"space",1,1,1]
[null,"space",1,1,1]
[null,"space",1,1,1]
[null,"space",1,1,1]
[null,"space",1,1,1]
[null,"space",1,1,1]
[null,"space",1,1,1]
[null,"space",1,1,1]
[null,"space",1,1,1]
[null,"space",1,1,1]
[null,"space",1,1,1]
[null,"space",1,1,1]
[null,"space",1,1,1]
[null,"space",1,1,1]
[null,"space",1,1,1]
[null,"space",1,1,1]
[null,"space",1,1,1]
[null,"space",1,1,1]
[null,"space",1,1,1]
[null,"space",1,1,1]
[null,"space",1,1,1]
[null,"space",1,1,1]
[null,"space",1,1,1]
[null,"space",1,1,1]
[null,"space",1,1,1]
[null,"space",1,1,1]
[null,"space",1,1,1]
[null,"space",1,1,1]
[null,"space",1,1,1]
[null,"space",1,1,1]
[null,"space",1,1,1]
[null,"space",1,1,1]
[null,"space",1,1,1]
[null,"space",1,1,1]
[null,"space",1,1,1]
[null,"space",1,1,1]
[null,"space",1,1,1]
[null,"space",{"$f":"IFERROR(FIND(A1538,\" \",1),0)","v":1},{"$f":"IFERROR(FIND(A1538,\"1234567890\",1),0)","v":1},{"$f":"IFERROR(FIND(A1538,\".,\",1),0)","v":1}]
[null,"space",1,1,1]
[null,"space",1,1,1]
[null,"space",1,1,1]
[null,"space",1,1,1]
[null,"space",1,1,1]
[null,"space",1,1,1]
[null,"space",1,1,1]
[null,"space",1,1,1]
[null,"space",1,1,1]
[null,"space",1,1,1]
[null,"space",1,1,1]
[null,"space",1,1,1]
[null,"space",1,1,1]
[null,"space",1,1,1]
[null,"space",1,1,1]
[null,"space",1,1,1]
[null,"space",1,1,1]
[null,{"$f":"IF((C1556 > 0),\"space\",(IF((D1556 > 0),\"num\",(IF((E1556 > 0),\"punch\",\"text\")))))","v":"space"},1,1,1]
[null,"space",1,1,1]
[null,"space",1,1,1]
[null,"space",1,1,1]
[null,"space",1,1,1]
[null,"space",1,1,1]
[null,"space",1,1,1]
[null,"space",1,1,1]
[null,"space",1,1,1]
[null,"space",1,1,1]
[null,"space",1,1,1]
[null,"space",1,1,1]
[null,"space",1,1,1]
[null,"space",1,1,1]
[null,"space",1,1,1]
[null,"space",1,1,1]
[null,"space",1,1,1]
[null,"space",1,1,1]
[null,"space",1,1,1]
[null,"space",1,1,1]
[null,"space",1,1,1]
[null,"space",1,1,1]
[null,"space",1,1,1]
[null,"space",1,1,1]
[null,"space",1,1,1]
[null,"space",1,1,1]
[null,"space",1,1,1]
[null,"space",1,1,1]
[null,"space",1,1,1]
[null,"space",1,1,1]
[null,"space",1,1,1]
[null,"space",1,1,1]
[null,"space",1,1,1]
[null,"space",1,1,1]
[null,"space",1,1,1]
[null,"space",1,1,1]
[null,"space",1,1,1]
[null,"space",1,1,1]
[null,"space",1,1,1]
[null,"space",1,1,1]
[null,"space",1,1,1]
[null,"space",1,1,1]
[null,"space",1,1,1]
[null,"space",1,1,1]
[null,"space",1,1,1]
[null,"space",1,1,1]
[null,"space",{"$f":"IFERROR(FIND(A1602,\" \",1),0)","v":1},{"$f":"IFERROR(FIND(A1602,\"1234567890\",1),0)","v":1},{"$f":"IFERROR(FIND(A1602,\".,\",1),0)","v":1}]
[null,"space",1,1,1]
[null,"space",1,1,1]
[null,"space",1,1,1]
[null,"space",1,1,1]
[null,"space",1,1,1]
[null,"space",1,1,1]
[null,"space",1,1,1]
[null,"space",1,1,1]
[null,"space",1,1,1]
[null,"space",1,1,1]
[null,"space",1,1,1]
[null,"space",1,1,1]
[null,"space",1,1,1]
[null,"space",1,1,1]
[null,"space",1,1,1]
[null,"space",1,1,1]
[null,"space",1,1,1]
[null,{"$f":"IF((C1620 > 0),\"space\",(IF((D1620 > 0),\"num\",(IF((E1620 > 0),\"punch\",\"text\")))))","v":"space"},1,1,1]
[null,"space",1,1,1]
[null,"space",1,1,1]
[null,"space",1,1,1]
[null,"space",1,1,1]
[null,"space",1,1,1]
[null,"space",1,1,1]
[null,"space",1,1,1]
[null,"space",1,1,1]
[null,"space",1,1,1]
[null,"space",1,1,1]
[null,"space",1,1,1]
[null,"space",1,1,1]
[null,"space",1,1,1]
[null,"space",1,1,1]
[null,"space",1,1,1]
[null,"space",1,1,1]
[null,"space",1,1,1]
[null,"space",1,1,1]
[null,"space",1,1,1]
[null,"space",1,1,1]
[null,"space",1,1,1]
[null,"space",1,1,1]
[null,"space",1,1,1]
[null,"space",1,1,1]
[null,"space",1,1,1]
[null,"space",1,1,1]
[null,"space",1,1,1]
[null,"space",1,1,1]
[null,"space",1,1,1]
[null,"space",1,1,1]
[null,"space",1,1,1]
[null,"space",1,1,1]
[null,"space",1,1,1]
[null,"space",1,1,1]
[null,"space",1,1,1]
[null,"space",1,1,1]
[null,"space",1,1,1]
[null,"space",1,1,1]
[null,"space",1,1,1]
[null,"space",1,1,1]
[null,"space",1,1,1]
[null,"space",1,1,1]
[null,"space",1,1,1]
[null,"space",1,1,1]
[null,"space",1,1,1]
[null,"space",{"$f":"IFERROR(FIND(A1666,\" \",1),0)","v":1},{"$f":"IFERROR(FIND(A1666,\"1234567890\",1),0)","v":1},{"$f":"IFERROR(FIND(A1666,\".,\",1),0)","v":1}]
[null,"space",1,1,1]
[null,"space",1,1,1]
[null,"space",1,1,1]
[null,"space",1,1,1]
[null,"space",1,1,1]
[null,"space",1,1,1]
[null,"space",1,1,1]
[null,"space",1,1,1]
[null,"space",1,1,1]
[null,"space",1,1,1]
[null,"space",1,1,1]
[null,"space",1,1,1]
[null,"space",1,1,1]
[null,"space",1,1,1]
[null,"space",1,1,1]
[null,"space",1,1,1]
[null,"space",1,1,1]
[null,{"$f":"IF((C1684 > 0),\"space\",(IF((D1684 > 0),\"num\",(IF((E1684 > 0),\"punch\",\"text\")))))","v":"space"},1,1,1]
[null,"space",1,1,1]
[null,"space",1,1,1]
[null,"space",1,1,1]
[null,"space",1,1,1]
[null,"space",1,1,1]
[null,"space",1,1,1]
[null,"space",1,1,1]
[null,"space",1,1,1]
[null,"space",1,1,1]
[null,"space",1,1,1]
[null,"space",1,1,1]
[null,"space",1,1,1]
[null,"space",1,1,1]
[null,"space",1,1,1]
[null,"space",1,1,1]
[null,"space",1,1,1]
[null,"space",1,1,1]
[null,"space",1,1,1]
[null,"space",1,1,1]
[null,"space",1,1,1]
[null,"space",1,1,1]
[null,"space",1,1,1]
[null,"space",1,1,1]
[null,"space",1,1,1]
[null,"space",1,1,1]
[null,"space",1,1,1]
[null,"space",1,1,1]
[null,"space",1,1,1]
[null,"space",1,1,1]
[null,"space",1,1,1]
[null,"space",1,1,1]
[null,"space",1,1,1]
[null,"space",1,1,1]
[null,"space",1,1,1]
[null,"space",1,1,1]
[null,"space",1,1,1]
[null,"space",1,1,1]
[null,"space",1,1,1]
[null,"space",1,1,1]
[null,"space",1,1,1]
[null,"space",1,1,1]
[null,"space",1,1,1]
[null,"space",1,1,1]
[null,"space",1,1,1]
[null,"space",1,1,1]
[null,"space",{"$f":"IFERROR(FIND(A1730,\" \",1),0)","v":1},{"$f":"IFERROR(FIND(A1730,\"1234567890\",1),0)","v":1},{"$f":"IFERROR(FIND(A1730,\".,\",1),0)","v":1}]
[null,"space",1,1,1]
[null,"space",1,1,1]
[null,"space",1,1,1]
[null,"space",1,1,1]
[null,"space",1,1,1]
[null,"space",1,1,1]
[null,"space",1,1,1]
[null,"space",1,1,1]
[null,"space",1,1,1]
[null,"space",1,1,1]
[null,"space",1,1,1]
[null,"space",1,1,1]
[null,"space",1,1,1]
[null,"space",1,1,1]
[null,"space",1,1,1]
[null,"space",1,1,1]
[null,"space",1,1,1]
[null,{"$f":"IF((C1748 > 0),\"space\",(IF((D1748 > 0),\"num\",(IF((E1748 > 0),\"punch\",\"text\")))))","v":"space"},1,1,1]
[null,"space",1,1,1]
[null,"space",1,1,1]
[null,"space",1,1,1]
[null,"space",1,1,1]
[null,"space",1,1,1]
[null,"space",1,1,1]
[null,"space",1,1,1]
[null,"space",1,1,1]
[null,"space",1,1,1]
[null,"space",1,1,1]
[null,"space",1,1,1]
[null,"space",1,1,1]
[null,"space",1,1,1]
[null,"space",1,1,1]
[null,"space",1,1,1]
[null,"space",1,1,1]
[null,"space",1,1,1]
[null,"space",1,1,1]
[null,"space",1,1,1]
[null,"space",1,1,1]
[null,"space",1,1,1]
[null,"space",1,1,1]
[null,"space",1,1,1]
[null,"space",1,1,1]
[null,"space",1,1,1]
[null,"space",1,1,1]
[null,"space",1,1,1]
[null,"space",1,1,1]
[null,"space",1,1,1]
[null,"space",1,1,1]
[null,"space",1,1,1]
[null,"space",1,1,1]
[null,"space",1,1,1]
[null,"space",1,1,1]
[null,"space",1,1,1]
[null,"space",1,1,1]
[null,"space",1,1,1]
[null,"space",1,1,1]
[null,"space",1,1,1]
[null,"space",1,1,1]
[null,"space",1,1,1]
[null,"space",1,1,1]
[null,"space",1,1,1]
[null,"space",1,1,1]
[null,"space",1,1,1]
[null,"space",{"$f":"IFERROR(FIND(A1794,\" \",1),0)","v":1},{"$f":"IFERROR(FIND(A1794,\"1234567890\",1),0)","v":1},{"$f":"IFERROR(FIND(A1794,\".,\",1),0)","v":1}]
[null,"space",1,1,1]
[null,"space",1,1,1]
[null,"space",1,1,1]
[null,"space",1,1,1]
[null,"space",1,1,1]
[null,"space",1,1,1]
[null,"space",1,1,1]
[null,"space",1,1,1]
[null,"space",1,1,1]
[null,"space",1,1,1]
[null,"space",1,1,1]
[null,"space",1,1,1]
[null,"space",1,1,1]
[null,"space",1,1,1]
[null,"space",1,1,1]
[null,"space",1,1,1]
[null,"space",1,1,1]
[null,{"$f":"IF((C1812 > 0),\"space\",(IF((D1812 > 0),\"num\",(IF((E1812 > 0),\"punch\",\"text\")))))","v":"space"},1,1,1]
[null,"space",1,1,1]
[null,"space",1,1,1]
[null,"space",1,1,1]
[null,"space",1,1,1]
[null,"space",1,1,1]
[null,"space",1,1,1]
[null,"space",1,1,1]
[null,"space",1,1,1]
[null,"space",1,1,1]
[null,"space",1,1,1]
[null,"space",1,1,1]
[null,"space",1,1,1]
[null,"space",1,1,1]
[null,"space",1,1,1]
[null,"space",1,1,1]
[null,"space",1,1,1]
[null,"space",1,1,1]
[null,"space",1,1,1]
[null,"space",1,1,1]
[null,"space",1,1,1]
[null,"space",1,1,1]
[null,"space",1,1,1]
[null,"space",1,1,1]
[null,"space",1,1,1]
[null,"space",1,1,1]
[null,"space",1,1,1]
[null,"space",1,1,1]
[null,"space",1,1,1]
[null,"space",1,1,1]
[null,"space",1,1,1]
[null,"space",1,1,1]
[null,"space",1,1,1]
[null,"space",1,1,1]
[null,"space",1,1,1]
[null,"space",1,1,1]
[null,"space",1,1,1]
[null,"space",1,1,1]
[null,"space",1,1,1]
[null,"space",1,1,1]
[null,"space",1,1,1]
[null,"space",1,1,1]
[null,"space",1,1,1]
[null,"space",1,1,1]
[null,"space",1,1,1]
[null,"space",1,1,1]
[null,"space",{"$f":"IFERROR(FIND(A1858,\" \",1),0)","v":1},{"$f":"IFERROR(FIND(A1858,\"1234567890\",1),0)","v":1},{"$f":"IFERROR(FIND(A1858,\".,\",1),0)","v":1}]
[null,"space",1,1,1]
[null,"space",1,1,1]
[null,"space",1,1,1]
[null,"space",1,1,1]
[null,"space",1,1,1]
[null,"space",1,1,1]
[null,"space",1,1,1]
[null,"space",1,1,1]
[null,"space",1,1,1]
[null,"space",1,1,1]
[null,"space",1,1,1]
[null,"space",1,1,1]
[null,"space",1,1,1]
[null,"space",1,1,1]
[null,"space",1,1,1]
[null,"space",1,1,1]
[null,"space",1,1,1]
[null,{"$f":"IF((C1876 > 0),\"space\",(IF((D1876 > 0),\"num\",(IF((E1876 > 0),\"punch\",\"text\")))))","v":"space"},1,1,1]
[null,"space",1,1,1]
[null,"space",1,1,1]
[null,"space",1,1,1]
[null,"space",1,1,1]
[null,"space",1,1,1]
[null,"space",1,1,1]
[null,"space",1,1,1]
[null,"space",1,1,1]
[null,"space",1,1,1]
[null,"space",1,1,1]
[null,"space",1,1,1]
[null,"space",1,1,1]
[null,"space",1,1,1]
[null,"space",1,1,1]
[null,"space",1,1,1]
[null,"space",1,1,1]
[null,"space",1,1,1]
[null,"space",1,1,1]
[null,"space",1,1,1]
[null,"space",1,1,1]
[null,"space",1,1,1]
[null,"space",1,1,1]
[null,"space",1,1,1]
[null,"space",1,1,1]
[null,"space",1,1,1]
[null,"space",1,1,1]
[null,"space",1,1,1]
[null,"space",1,1,1]
[null,"space",1,1,1]
[null,"space",1,1,1]
[null,"space",1,1,1]
[null,"space",1,1,1]
[null,"space",1,1,1]
[null,"space",1,1,1]
[null,"space",1,1,1]
[null,"space",1,1,1]
[null,"space",1,1,1]
[null,"space",1,1,1]
[null,"space",1,1,1]
[null,"space",1,1,1]
[null,"space",1,1,1]
[null,"space",1,1,1]
[null,"space",1,1,1]
[null,"space",1,1,1]
[null,"space",1,1,1]
[null,"space",{"$f":"IFERROR(FIND(A1922,\" \",1),0)","v":1},{"$f":"IFERROR(FIND(A1922,\"1234567890\",1),0)","v":1},{"$f":"IFERROR(FIND(A1922,\".,\",1),0)","v":1}]
[null,"space",1,1,1]
[null,"space",1,1,1]
[null,"space",1,1,1]
[null,"space",1,1,1]
[null,"space",1,1,1]
[null,"space",1,1,1]
[null,"space",1,1,1]
[null,"space",1,1,1]
[null,"space",1,1,1]
[null,"space",1,1,1]
[null,"space",1,1,1]
[null,"space",1,1,1]
[null,"space",1,1,1]
[null,"space",1,1,1]
[null,"space",1,1,1]
[null,"space",1,1,1]
[null,"space",1,1,1]
[null,{"$f":"IF((C1940 > 0),\"space\",(IF((D1940 > 0),\"num\",(IF((E1940 > 0),\"punch\",\"text\")))))","v":"space"},1,1,1]
[null,"space",1,1,1]
[null,"space",1,1,1]
[null,"space",1,1,1]
[null,"space",1,1,1]
[null,"space",1,1,1]
[null,"space",1,1,1]
[null,"space",1,1,1]
[null,"space",1,1,1]
[null,"space",1,1,1]
[null,"space",1,1,1]
[null,"space",1,1,1]
[null,"space",1,1,1]
[null,"space",1,1,1]
[null,"space",1,1,1]
[null,"space",1,1,1]
[null,"space",1,1,1]
[null,"space",1,1,1]
[null,"space",1,1,1]
[null,"space",1,1,1]
[null,"space",1,1,1]
[null,"space",1,1,1]
[null,"space",1,1,1]
[null,"space",1,1,1]
[null,"space",1,1,1]
[null,"space",1,1,1]
[null,"space",1,1,1]
[null,"space",1,1,1]
[null,"space",1,1,1]
[null,"space",1,1,1]
[null,"space",1,1,1]
[null,"space",1,1,1]
[null,"space",1,1,1]
[null,"space",1,1,1]
[null,"space",1,1,1]
[null,"space",1,1,1]
[null,"space",1,1,1]
[null,"space",1,1,1]
[null,"space",1,1,1]
[null,"space",1,1,1]
[null,"space",1,1,1]
[null,"space",1,1,1]
[null,"space",1,1,1]
[null,"space",1,1,1]
[null,"space",1,1,1]
[null,"space",1,1,1]
[null,"space",{"$f":"IFERROR(FIND(A1986,\" \",1),0)","v":1},{"$f":"IFERROR(FIND(A1986,\"1234567890\",1),0)","v":1},{"$f":"IFERROR(FIND(A1986,\".,\",1),0)","v":1}]
[null,"space",1,1,1]
[null,"space",1,1,1]
[null,"space",1,1,1]
[null,"space",1,1,1]
[null,"space",1,1,1]
[null,"space",1,1,1]
[null,"space",1,1,1]
[null,"space",1,1,1]
[null,"space",1,1,1]
[null,"space",1,1,1]
[null,"space",1,1,1]
[null,"space",1,1,1]
[null,"space",1,1,1]
[null,"space",1,1,1]
[null,"space",1,1,1]
[null,"space",1,1,1]
[null,"space",1,1,1]
[null,{"$f":"IF((C2004 > 0),\"space\",(IF((D2004 > 0),\"num\",(IF((E2004 > 0),\"punch\",\"text\")))))","v":"space"},1,1,1]
[null,"space",1,1,1]
[null,"space",1,1,1]
[null,"space",1,1,1]
[null,"space",1,1,1]
[null,"space",1,1,1]
[null,"space",1,1,1]
[null,"space",1,1,1]
[null,"space",1,1,1]
[null,"space",1,1,1]
[null,"space",1,1,1]
[null,"space",1,1,1]
[null,"space",1,1,1]
[null,"space",1,1,1]
[null,"space",1,1,1]
[null,"space",1,1,1]
[null,"space",1,1,1]
[null,"space",1,1,1]
[null,"space",1,1,1]
[null,"space",1,1,1]
[null,"space",1,1,1]
[null,"space",1,1,1]
[null,"space",1,1,1]
[null,"space",1,1,1]
[null,"space",1,1,1]
[null,"space",1,1,1]
[null,"space",1,1,1]
[null,"space",1,1,1]
[null,"space",1,1,1]
[null,"space",1,1,1]
[null,"space",1,1,1]
[null,"space",1,1,1]
[null,"space",1,1,1]
[null,"space",1,1,1]
[null,"space",1,1,1]
[null,"space",1,1,1]
[null,"space",1,1,1]
[null,"space",1,1,1]
[null,"space",1,1,1]
[null,"space",1,1,1]
[null,"space",1,1,1]
[null,"space",1,1,1]
[null,"space",1,1,1]
[null,"space",1,1,1]
[null,"space",1,1,1]
[null,"space",1,1,1]
[null,"space",{"$f":"IFERROR(FIND(A2050,\" \",1),0)","v":1},{"$f":"IFERROR(FIND(A2050,\"1234567890\",1),0)","v":1},{"$f":"IFERROR(FIND(A2050,\".,\",1),0)","v":1}]
[null,"space",1,1,1]
[null,"space",1,1,1]
[null,"space",1,1,1]
[null,"space",1,1,1]
[null,"space",1,1,1]
[null,"space",1,1,1]
[null,"space",1,1,1]
[null,"space",1,1,1]
[null,"space",1,1,1]
[null,"space",1,1,1]
[null,"space",1,1,1]
[null,"space",1,1,1]
[null,"space",1,1,1]
[null,"space",1,1,1]
[null,"space",1,1,1]
[null,"space",1,1,1]
[null,"space",1,1,1]
[null,{"$f":"IF((C2068 > 0),\"space\",(IF((D2068 > 0),\"num\",(IF((E2068 > 0),\"punch\",\"text\")))))","v":"space"},1,1,1]
[null,"space",1,1,1]
[null,"space",1,1,1]
[null,"space",1,1,1]
[null,"space",1,1,1]
[null,"space",1,1,1]
[null,"space",1,1,1]
[null,"space",1,1,1]
[null,"space",1,1,1]
[null,"space",1,1,1]
[null,"space",1,1,1]
[null,"space",1,1,1]
[null,"space",1,1,1]
[null,"space",1,1,1]
[null,"space",1,1,1]
[null,"space",1,1,1]
[null,"space",1,1,1]
[null,"space",1,1,1]
[null,"space",1,1,1]
[null,"space",1,1,1]
[null,"space",1,1,1]
[null,"space",1,1,1]
[null,"space",1,1,1]
[null,"space",1,1,1]
[null,"space",1,1,1]
[null,"space",1,1,1]
[null,"space",1,1,1]
[null,"space",1,1,1]
[null,"space",1,1,1]
[null,"space",1,1,1]
[null,"space",1,1,1]
[null,"space",1,1,1]
[null,"space",1,1,1]
[null,"space",1,1,1]
[null,"space",1,1,1]
[null,"space",1,1,1]
[null,"space",1,1,1]
[null,"space",1,1,1]
[null,"space",1,1,1]
[null,"space",1,1,1]
[null,"space",1,1,1]
[null,"space",1,1,1]
[null,"space",1,1,1]
[null,"space",1,1,1]
[null,"space",1,1,1]
[null,"space",1,1,1]
[null,"space",{"$f":"IFERROR(FIND(A2114,\" \",1),0)","v":1},{"$f":"IFERROR(FIND(A2114,\"1234567890\",1),0)","v":1},{"$f":"IFERROR(FIND(A2114,\".,\",1),0)","v":1}]
[null,"space",1,1,1]
[null,"space",1,1,1]
[null,"space",1,1,1]
[null,"space",1,1,1]
[null,"space",1,1,1]
[null,"space",1,1,1]
[null,"space",1,1,1]
[null,"space",1,1,1]
[null,"space",1,1,1]
[null,"space",1,1,1]
[null,"space",1,1,1]
[null,"space",1,1,1]
[null,"space",1,1,1]
[null,"space",1,1,1]
[null,"space",1,1,1]
[null,"space",1,1,1]
[null,"space",1,1,1]
[null,{"$f":"IF((C2132 > 0),\"space\",(IF((D2132 > 0),\"num\",(IF((E2132 > 0),\"punch\",\"text\")))))","v":"space"},1,1,1]
[null,"space",1,1,1]
[null,"space",1,1,1]
[null,"space",1,1,1]
[null,"space",1,1,1]
[null,"space",1,1,1]
[null,"space",1,1,1]
[null,"space",1,1,1]
[null,"space",1,1,1]
[null,"space",1,1,1]
[null,"space",1,1,1]
[null,"space",1,1,1]
[null,"space",1,1,1]
[null,"space",1,1,1]
[null,"space",1,1,1]
[null,"space",1,1,1]
[null,"space",1,1,1]
[null,"space",1,1,1]
[null,"space",1,1,1]
[null,"space",1,1,1]
[null,"space",1,1,1]
[null,"space",1,1,1]
[null,"space",1,1,1]
[null,"space",1,1,1]
[null,"space",1,1,1]
[null,"space",1,1,1]
[null,"space",1,1,1]
[null,"space",1,1,1]
[null,"space",1,1,1]
[null,"space",1,1,1]
[null,"space",1,1,1]
[null,"space",1,1,1]
[null,"space",1,1,1]
[null,"space",1,1,1]
[null,"space",1,1,1]
[null,"space",1,1,1]
[null,"space",1,1,1]
[null,"space",1,1,1]
[null,"space",1,1,1]
[null,"space",1,1,1]
[null,"space",1,1,1]
[null,"space",1,1,1]
[null,"space",1,1,1]
[null,"space",1,1,1]
[null,"space",1,1,1]
[null,"space",1,1,1]
[null,"space",{"$f":"IFERROR(FIND(A2178,\" \",1),0)","v":1},{"$f":"IFERROR(FIND(A2178,\"1234567890\",1),0)","v":1},{"$f":"IFERROR(FIND(A2178,\".,\",1),0)","v":1}]
[null,"space",1,1,1]
[null,"space",1,1,1]
[null,"space",1,1,1]
[null,"space",1,1,1]
[null,"space",1,1,1]
[null,"space",1,1,1]
[null,"space",1,1,1]
[null,"space",1,1,1]
[null,"space",1,1,1]
[null,"space",1,1,1]
[null,"space",1,1,1]
[null,"space",1,1,1]
[null,"space",1,1,1]
[null,"space",1,1,1]
[null,"space",1,1,1]
[null,"space",1,1,1]
[null,"space",1,1,1]
[null,{"$f":"IF((C2196 > 0),\"space\",(IF((D2196 > 0),\"num\",(IF((E2196 > 0),\"punch\",\"text\")))))","v":"space"},1,1,1]
[null,"space",1,1,1]
[null,"space",1,1,1]
[null,"space",1,1,1]
[null,"space",1,1,1]
[null,"space",1,1,1]
[null,"space",1,1,1]
[null,"space",1,1,1]
[null,"space",1,1,1]
[null,"space",1,1,1]
[null,"space",1,1,1]
[null,"space",1,1,1]
[null,"space",1,1,1]
[null,"space",1,1,1]
[null,"space",1,1,1]
[null,"space",1,1,1]
[null,"space",1,1,1]
[null,"space",1,1,1]
[null,"space",1,1,1]
[null,"space",1,1,1]
[null,"space",1,1,1]
[null,"space",1,1,1]
[null,"space",1,1,1]
[null,"space",1,1,1]
[null,"space",1,1,1]
[null,"space",1,1,1]
[null,"space",1,1,1]
[null,"space",1,1,1]
[null,"space",1,1,1]
[null,"space",1,1,1]
[null,"space",1,1,1]
[null,"space",1,1,1]
[null,"space",1,1,1]
[null,"space",1,1,1]
[null,"space",1,1,1]
[null,"space",1,1,1]
[null,"space",1,1,1]
[null,"space",1,1,1]
[null,"space",1,1,1]
[null,"space",1,1,1]
[null,"space",1,1,1]
[null,"space",1,1,1]
[null,"space",1,1,1]
[null,"space",1,1,1]
[null,"space",1,1,1]
[null,"space",1,1,1]
[null,"space",{"$f":"IFERROR(FIND(A2242,\" \",1),0)","v":1},{"$f":"IFERROR(FIND(A2242,\"1234567890\",1),0)","v":1},{"$f":"IFERROR(FIND(A2242,\".,\",1),0)","v":1}]
[null,"space",1,1,1]
[null,"space",1,1,1]
[null,"space",1,1,1]
[null,"space",1,1,1]
[null,"space",1,1,1]
[null,"space",1,1,1]
[null,"space",1,1,1]
[null,"space",1,1,1]
[null,"space",1,1,1]
[null,"space",1,1,1]
[null,"space",1,1,1]
[null,"space",1,1,1]
[null,"space",1,1,1]
[null,"space",1,1,1]
[null,"space",1,1,1]
[null,"space",1,1,1]
[null,"space",1,1,1]
[null,{"$f":"IF((C2260 > 0),\"space\",(IF((D2260 > 0),\"num\",(IF((E2260 > 0),\"punch\",\"text\")))))","v":"space"},1,1,1]
[null,"space",1,1,1]
[null,"space",1,1,1]
[null,"space",1,1,1]
[null,"space",1,1,1]
[null,"space",1,1,1]
[null,"space",1,1,1]
[null,"space",1,1,1]
[null,"space",1,1,1]
[null,"space",1,1,1]
[null,"space",1,1,1]
[null,"space",1,1,1]
[null,"space",1,1,1]
[null,"space",1,1,1]
[null,"space",1,1,1]
[null,"space",1,1,1]
[null,"space",1,1,1]
[null,"space",1,1,1]
[null,"space",1,1,1]
[null,"space",1,1,1]
[null,"space",1,1,1]
[null,"space",1,1,1]
[null,"space",1,1,1]
[null,"space",1,1,1]
[null,"space",1,1,1]
[null,"space",1,1,1]
[null,"space",1,1,1]
[null,"space",1,1,1]
[null,"space",1,1,1]
[null,"space",1,1,1]
[null,"space",1,1,1]
[null,"space",1,1,1]
[null,"space",1,1,1]
[null,"space",1,1,1]
[null,"space",1,1,1]
[null,"space",1,1,1]
[null,"space",1,1,1]
[null,"space",1,1,1]
[null,"space",1,1,1]
[null,"space",1,1,1]
[null,"space",1,1,1]
[null,"space",1,1,1]
[null,"space",1,1,1]
[null,"space",1,1,1]
[null,"space",1,1,1]
[null,"space",1,1,1]
[null,"space",{"$f":"IFERROR(FIND(A2306,\" \",1),0)","v":1},{"$f":"IFERROR(FIND(A2306,\"1234567890\",1),0)","v":1},{"$f":"IFERROR(FIND(A2306,\".,\",1),0)","v":1}]
[null,"space",1,1,1]
[null,"space",1,1,1]
[null,"space",1,1,1]
[null,"space",1,1,1]
[null,"space",1,1,1]
[null,"space",1,1,1]
[null,"space",1,1,1]
[null,"space",1,1,1]
[null,"space",1,1,1]
[null,"space",1,1,1]
[null,"space",1,1,1]
[null,"space",1,1,1]
[null,"space",1,1,1]
[null,"space",1,1,1]
[null,"space",1,1,1]
[null,"space",1,1,1]
[null,"space",1,1,1]
[null,{"$f":"IF((C2324 > 0),\"space\",(IF((D2324 > 0),\"num\",(IF((E2324 > 0),\"punch\",\"text\")))))","v":"space"},1,1,1]
[null,"space",1,1,1]
[null,"space",1,1,1]
[null,"space",1,1,1]
[null,"space",1,1,1]
[null,"space",1,1,1]
[null,"space",1,1,1]
[null,"space",1,1,1]
[null,"space",1,1,1]
[null,"space",1,1,1]
[null,"space",1,1,1]
[null,"space",1,1,1]
[null,"space",1,1,1]
[null,"space",1,1,1]
[null,"space",1,1,1]
[null,"space",1,1,1]
[null,"space",1,1,1]
[null,"space",1,1,1]
[null,"space",1,1,1]
[null,"space",1,1,1]
[null,"space",1,1,1]
[null,"space",1,1,1]
[null,"space",1,1,1]
[null,"space",1,1,1]
[null,"space",1,1,1]
[null,"space",1,1,1]
[null,"space",1,1,1]
[null,"space",1,1,1]
[null,"space",1,1,1]
[null,"space",1,1,1]
[null,"space",1,1,1]
[null,"space",1,1,1]
[null,"space",1,1,1]
[null,"space",1,1,1]
[null,"space",1,1,1]
[null,"space",1,1,1]
[null,"space",1,1,1]
[null,"space",1,1,1]
[null,"space",1,1,1]
[null,"space",1,1,1]
[null,"space",1,1,1]
[null,"space",1,1,1]
[null,"space",1,1,1]
[null,"space",1,1,1]
[null,"space",1,1,1]
[null,"space",1,1,1]
[null,"space",{"$f":"IFERROR(FIND(A2370,\" \",1),0)","v":1},{"$f":"IFERROR(FIND(A2370,\"1234567890\",1),0)","v":1},{"$f":"IFERROR(FIND(A2370,\".,\",1),0)","v":1}]
[null,"space",1,1,1]
[null,"space",1,1,1]
[null,"space",1,1,1]
[null,"space",1,1,1]
[null,"space",1,1,1]
[null,"space",1,1,1]
[null,"space",1,1,1]
[null,"space",1,1,1]
[null,"space",1,1,1]
[null,"space",1,1,1]
[null,"space",1,1,1]
[null,"space",1,1,1]
[null,"space",1,1,1]
[null,"space",1,1,1]
[null,"space",1,1,1]
[null,"space",1,1,1]
[null,"space",1,1,1]
[null,{"$f":"IF((C2388 > 0),\"space\",(IF((D2388 > 0),\"num\",(IF((E2388 > 0),\"punch\",\"text\")))))","v":"space"},1,1,1]
[null,"space",1,1,1]
[null,"space",1,1,1]
[null,"space",1,1,1]
[null,"space",1,1,1]
[null,"space",1,1,1]
[null,"space",1,1,1]
[null,"space",1,1,1]
[null,"space",1,1,1]
[null,"space",1,1,1]
[null,"space",1,1,1]
[null,"space",1,1,1]
[null,"space",1,1,1]
[null,"space",1,1,1]
[null,"space",1,1,1]
[null,"space",1,1,1]
[null,"space",1,1,1]
[null,"space",1,1,1]
[null,"space",1,1,1]
[null,"space",1,1,1]
[null,"space",1,1,1]
[null,"space",1,1,1]
[null,"space",1,1,1]
[null,"space",1,1,1]
[null,"space",1,1,1]
[null,"space",1,1,1]
[null,"space",1,1,1]
[null,"space",1,1,1]
[null,"space",1,1,1]
[null,"space",1,1,1]
[null,"space",1,1,1]
[null,"space",1,1,1]
[null,"space",1,1,1]
[null,"space",1,1,1]
[null,"space",1,1,1]
[null,"space",1,1,1]
[null,"space",1,1,1]
[null,"space",1,1,1]
[null,"space",1,1,1]
[null,"space",1,1,1]
[null,"space",1,1,1]
[null,"space",1,1,1]
[null,"space",1,1,1]
[null,"space",1,1,1]
[null,"space",1,1,1]
[null,"space",1,1,1]
[null,"space",{"$f":"IFERROR(FIND(A2434,\" \",1),0)","v":1},{"$f":"IFERROR(FIND(A2434,\"1234567890\",1),0)","v":1},{"$f":"IFERROR(FIND(A2434,\".,\",1),0)","v":1}]
[null,"space",1,1,1]
[null,"space",1,1,1]
[null,"space",1,1,1]
[null,"space",1,1,1]
[null,"space",1,1,1]
[null,"space",1,1,1]
[null,"space",1,1,1]
[null,"space",1,1,1]
[null,"space",1,1,1]
[null,"space",1,1,1]
[null,"space",1,1,1]
[null,"space",1,1,1]
[null,"space",1,1,1]
[null,"space",1,1,1]
[null,"space",1,1,1]
[null,"space",1,1,1]
[null,"space",1,1,1]
[null,{"$f":"IF((C2452 > 0),\"space\",(IF((D2452 > 0),\"num\",(IF((E2452 > 0),\"punch\",\"text\")))))","v":"space"},1,1,1]
[null,"space",1,1,1]
[null,"space",1,1,1]
[null,"space",1,1,1]
[null,"space",1,1,1]
[null,"space",1,1,1]
[null,"space",1,1,1]
[null,"space",1,1,1]
[null,"space",1,1,1]
[null,"space",1,1,1]
[null,"space",1,1,1]
[null,"space",1,1,1]
[null,"space",1,1,1]
[null,"space",1,1,1]
[null,"space",1,1,1]
[null,"space",1,1,1]
[null,"space",1,1,1]
[null,"space",1,1,1]
[null,"space",1,1,1]
[null,"space",1,1,1]
[null,"space",1,1,1]
[null,"space",1,1,1]
[null,"space",1,1,1]
[null,"space",1,1,1]
[null,"space",1,1,1]
[null,"space",1,1,1]
[null,"space",1,1,1]
[null,"space",1,1,1]
[null,"space",1,1,1]
[null,"space",1,1,1]
[null,"space",1,1,1]
[null,"space",1,1,1]
[null,"space",1,1,1]
[null,"space",1,1,1]
[null,"space",1,1,1]
[null,"space",1,1,1]
[null,"space",1,1,1]
[null,"space",1,1,1]
[null,"space",1,1,1]
[null,"space",1,1,1]
[null,"space",1,1,1]
[null,"space",1,1,1]
[null,"space",1,1,1]
[null,"space",1,1,1]
[null,"space",1,1,1]
[null,"space",1,1,1]
[null,"space",{"$f":"IFERROR(FIND(A2498,\" \",1),0)","v":1},{"$f":"IFERROR(FIND(A2498,\"1234567890\",1),0)","v":1},{"$f":"IFERROR(FIND(A2498,\".,\",1),0)","v":1}]
[null,"space",1,1,1]
[null,"space",1,1,1]
[null,"space",1,1,1]
[null,"space",1,1,1]
[null,"space",1,1,1]
[null,"space",1,1,1]
[null,"space",1,1,1]
[null,"space",1,1,1]
[null,"space",1,1,1]
[null,"space",1,1,1]
[null,"space",1,1,1]
[null,"space",1,1,1]
[null,"space",1,1,1]
[null,"space",1,1,1]
[null,"space",1,1,1]
[null,"space",1,1,1]
[null,"space",1,1,1]
[null,{"$f":"IF((C2516 > 0),\"space\",(IF((D2516 > 0),\"num\",(IF((E2516 > 0),\"punch\",\"text\")))))","v":"space"},1,1,1]
[null,"space",1,1,1]
[null,"space",1,1,1]
[null,"space",1,1,1]
[null,"space",1,1,1]
[null,"space",1,1,1]
[null,"space",1,1,1]
[null,"space",1,1,1]
[null,"space",1,1,1]
[null,"space",1,1,1]
[null,"space",1,1,1]
[null,"space",1,1,1]
[null,"space",1,1,1]
[null,"space",1,1,1]
[null,"space",1,1,1]
[null,"space",1,1,1]
[null,"space",1,1,1]
[null,"space",1,1,1]
[null,"space",1,1,1]
[null,"space",1,1,1]
[null,"space",1,1,1]
[null,"space",1,1,1]
[null,"space",1,1,1]
[null,"space",1,1,1]
[null,"space",1,1,1]
[null,"space",1,1,1]
[null,"space",1,1,1]
[null,"space",1,1,1]
[null,"space",1,1,1]
[null,"space",1,1,1]
[null,"space",1,1,1]
[null,"space",1,1,1]
[null,"space",1,1,1]
[null,"space",1,1,1]
[null,"space",1,1,1]
[null,"space",1,1,1]
[null,"space",1,1,1]
[null,"space",1,1,1]
[null,"space",1,1,1]
[null,"space",1,1,1]
[null,"space",1,1,1]
[null,"space",1,1,1]
[null,"space",1,1,1]
[null,"space",1,1,1]
[null,"space",1,1,1]
[null,"space",1,1,1]
[null,"space",{"$f":"IFERROR(FIND(A2562,\" \",1),0)","v":1},{"$f":"IFERROR(FIND(A2562,\"1234567890\",1),0)","v":1},{"$f":"IFERROR(FIND(A2562,\".,\",1),0)","v":1}]
[null,"space",1,1,1]
[null,"space",1,1,1]
[null,"space",1,1,1]
[null,"space",1,1,1]
[null,"space",1,1,1]
[null,"space",1,1,1]
[null,"space",1,1,1]
[null,"space",1,1,1]
[null,"space",1,1,1]
[null,"space",1,1,1]
[null,"space",1,1,1]
[null,"space",1,1,1]
[null,"space",1,1,1]
[null,"space",1,1,1]
[null,"space",1,1,1]
[null,"space",1,1,1]
[null,"space",1,1,1]
[null,{"$f":"IF((C2580 > 0),\"space\",(IF((D2580 > 0),\"num\",(IF((E2580 > 0),\"punch\",\"text\")))))","v":"space"},1,1,1]
[null,"space",1,1,1]
[null,"space",1,1,1]
[null,"space",1,1,1]
[null,"space",1,1,1]
[null,"space",1,1,1]
[null,"space",1,1,1]
[null,"space",1,1,1]
[null,"space",1,1,1]
[null,"space",1,1,1]
[null,"space",1,1,1]
[null,"space",1,1,1]
[null,"space",1,1,1]
[null,"space",1,1,1]
[null,"space",1,1,1]
[null,"space",1,1,1]
[null,"space",1,1,1]
[null,"space",1,1,1]
[null,"space",1,1,1]
[null,"space",1,1,1]
[null,"space",1,1,1]
[null,"space",1,1,1]
[null,"space",1,1,1]
[null,"space",1,1,1]
[null,"space",1,1,1]
[null,"space",1,1,1]
[null,"space",1,1,1]
[null,"space",1,1,1]
[null,"space",1,1,1]
[null,"space",1,1,1]
[null,"space",1,1,1]
[null,"space",1,1,1]
[null,"space",1,1,1]
[null,"space",1,1,1]
[null,"space",1,1,1]
[null,"space",1,1,1]
[null,"space",1,1,1]
[null,"space",1,1,1]
[null,"space",1,1,1]
[null,"space",1,1,1]
[null,"space",1,1,1]
[null,"space",1,1,1]
[null,"space",1,1,1]
[null,"space",1,1,1]
[null,"space",1,1,1]
[null,"space",1,1,1]
[null,"space",{"$f":"IFERROR(FIND(A2626,\" \",1),0)","v":1},{"$f":"IFERROR(FIND(A2626,\"1234567890\",1),0)","v":1},{"$f":"IFERROR(FIND(A2626,\".,\",1),0)","v":1}]
[null,"space",1,1,1]
[null,"space",1,1,1]
[null,"space",1,1,1]
[null,"space",1,1,1]
[null,"space",1,1,1]
[null,"space",1,1,1]
[null,"space",1,1,1]
[null,"space",1,1,1]
[null,"space",1,1,1]
[null,"space",1,1,1]
[null,"space",1,1,1]
[null,"space",1,1,1]
[null,"space",1,1,1]
[null,"space",1,1,1]
[null,"space",1,1,1]
[null,"space",1,1,1]
[null,"space",1,1,1]
[null,{"$f":"IF((C2644 > 0),\"space\",(IF((D2644 > 0),\"num\",(IF((E2644 > 0),\"punch\",\"text\")))))","v":"space"},1,1,1]
[null,"space",1,1,1]
[null,"space",1,1,1]
[null,"space",1,1,1]
[null,"space",1,1,1]
[null,"space",1,1,1]
[null,"space",1,1,1]
[null,"space",1,1,1]
[null,"space",1,1,1]
[null,"space",1,1,1]
[null,"space",1,1,1]
[null,"space",1,1,1]
[null,"space",1,1,1]
[null,"space",1,1,1]
[null,"space",1,1,1]
[null,"space",1,1,1]
[null,"space",1,1,1]
[null,"space",1,1,1]
[null,"space",1,1,1]
[null,"space",1,1,1]
[null,"space",1,1,1]
[null,"space",1,1,1]
[null,"space",1,1,1]
[null,"space",1,1,1]
[null,"space",1,1,1]
[null,"space",1,1,1]
[null,"space",1,1,1]
[null,"space",1,1,1]
[null,"space",1,1,1]
[null,"space",1,1,1]
[null,"space",1,1,1]
[null,"space",1,1,1]
[null,"space",1,1,1]
[null,"space",1,1,1]
[null,"space",1,1,1]
[null,"space",1,1,1]
[null,"space",1,1,1]
[null,"space",1,1,1]
[null,"space",1,1,1]
[null,"space",1,1,1]
[null,"space",1,1,1]
[null,"space",1,1,1]
[null,"space",1,1,1]
[null,"space",1,1,1]
[null,"space",1,1,1]
[null,"space",1,1,1]
[null,"space",{"$f":"IFERROR(FIND(A2690,\" \",1),0)","v":1},{"$f":"IFERROR(FIND(A2690,\"1234567890\",1),0)","v":1},{"$f":"IFERROR(FIND(A2690,\".,\",1),0)","v":1}]
[null,"space",1,1,1]
[null,"space",1,1,1]
[null,"space",1,1,1]
[null,"space",1,1,1]
[null,"space",1,1,1]
[null,"space",1,1,1]
[null,"space",1,1,1]
[null,"space",1,1,1]
[null,"space",1,1,1]
[null,"space",1,1,1]
[null,"space",1,1,1]
[null,"space",1,1,1]
[null,"space",1,1,1]
[null,"space",1,1,1]
[null,"space",1,1,1]
[null,"space",1,1,1]
[null,"space",1,1,1]
[null,{"$f":"IF((C2708 > 0),\"space\",(IF((D2708 > 0),\"num\",(IF((E2708 > 0),\"punch\",\"text\")))))","v":"space"},1,1,1]
[null,"space",1,1,1]
[null,"space",1,1,1]
[null,"space",1,1,1]
[null,"space",1,1,1]
[null,"space",1,1,1]
[null,"space",1,1,1]
[null,"space",1,1,1]
[null,"space",1,1,1]
[null,"space",1,1,1]
[null,"space",1,1,1]
[null,"space",1,1,1]
[null,"space",1,1,1]
[null,"space",1,1,1]
[null,"space",1,1,1]
[null,"space",1,1,1]
[null,"space",1,1,1]
[null,"space",1,1,1]
[null,"space",1,1,1]
[null,"space",1,1,1]
[null,"space",1,1,1]
[null,"space",1,1,1]
[null,"space",1,1,1]
[null,"space",1,1,1]
[null,"space",1,1,1]
[null,"space",1,1,1]
[null,"space",1,1,1]
[null,"space",1,1,1]
[null,"space",1,1,1]
[null,"space",1,1,1]
[null,"space",1,1,1]
[null,"space",1,1,1]
[null,"space",1,1,1]
[null,"space",1,1,1]
[null,"space",1,1,1]
[null,"space",1,1,1]
[null,"space",1,1,1]
[null,"space",1,1,1]
[null,"space",1,1,1]
[null,"space",1,1,1]
[null,"space",1,1,1]
[null,"space",1,1,1]
[null,"space",1,1,1]
[null,"space",1,1,1]
[null,"space",1,1,1]
[null,"space",1,1,1]
[null,"space",{"$f":"IFERROR(FIND(A2754,\" \",1),0)","v":1},{"$f":"IFERROR(FIND(A2754,\"1234567890\",1),0)","v":1},{"$f":"IFERROR(FIND(A2754,\".,\",1),0)","v":1}]
[null,"space",1,1,1]
[null,"space",1,1,1]
[null,"space",1,1,1]
[null,"space",1,1,1]
[null,"space",1,1,1]
[null,"space",1,1,1]
[null,"space",1,1,1]
[null,"space",1,1,1]
[null,"space",1,1,1]
[null,"space",1,1,1]
[null,"space",1,1,1]
[null,"space",1,1,1]
[null,"space",1,1,1]
[null,"space",1,1,1]
[null,"space",1,1,1]
[null,"space",1,1,1]
[null,"space",1,1,1]
[null,{"$f":"IF((C2772 > 0),\"space\",(IF((D2772 > 0),\"num\",(IF((E2772 > 0),\"punch\",\"text\")))))","v":"space"},1,1,1]
[null,"space",1,1,1]
[null,"space",1,1,1]
[null,"space",1,1,1]
[null,"space",1,1,1]
[null,"space",1,1,1]
[null,"space",1,1,1]
[null,"space",1,1,1]
[null,"space",1,1,1]
[null,"space",1,1,1]
[null,"space",1,1,1]
[null,"space",1,1,1]
[null,"space",1,1,1]
[null,"space",1,1,1]
[null,"space",1,1,1]
[null,"space",1,1,1]
[null,"space",1,1,1]
[null,"space",1,1,1]
[null,"space",1,1,1]
[null,"space",1,1,1]
[null,"space",1,1,1]
[null,"space",1,1,1]
[null,"space",1,1,1]
[null,"space",1,1,1]
[null,"space",1,1,1]
[null,"space",1,1,1]
[null,"space",1,1,1]
[null,"space",1,1,1]
[null,"space",1,1,1]
[null,"space",1,1,1]
[null,"space",1,1,1]
[null,"space",1,1,1]
[null,"space",1,1,1]
[null,"space",1,1,1]
[null,"space",1,1,1]
[null,"space",1,1,1]
[null,"space",1,1,1]
[null,"space",1,1,1]
[null,"space",1,1,1]
[null,"space",1,1,1]
[null,"space",1,1,1]
[null,"space",1,1,1]
[null,"space",1,1,1]
[null,"space",1,1,1]
[null,"space",1,1,1]
[null,"space",1,1,1]
[null,"space",{"$f":"IFERROR(FIND(A2818,\" \",1),0)","v":1},{"$f":"IFERROR(FIND(A2818,\"1234567890\",1),0)","v":1},{"$f":"IFERROR(FIND(A2818,\".,\",1),0)","v":1}]
[null,"space",1,1,1]
[null,"space",1,1,1]
[null,"space",1,1,1]
[null,"space",1,1,1]
[null,"space",1,1,1]
[null,"space",1,1,1]
[null,"space",1,1,1]
[null,"space",1,1,1]
[null,"space",1,1,1]
[null,"space",1,1,1]
[null,"space",1,1,1]
[null,"space",1,1,1]
[null,"space",1,1,1]
[null,"space",1,1,1]
[null,"space",1,1,1]
[null,"space",1,1,1]
[null,"space",1,1,1]
[null,{"$f":"IF((C2836 > 0),\"space\",(IF((D2836 > 0),\"num\",(IF((E2836 > 0),\"punch\",\"text\")))))","v":"space"},1,1,1]
[null,"space",1,1,1]
[null,"space",1,1,1]
[null,"space",1,1,1]
[null,"space",1,1,1]
[null,"space",1,1,1]
[null,"space",1,1,1]
[null,"space",1,1,1]
[null,"space",1,1,1]
[null,"space",1,1,1]
[null,"space",1,1,1]
[null,"space",1,1,1]
[null,"space",1,1,1]
[null,"space",1,1,1]
[null,"space",1,1,1]
[null,"space",1,1,1]
[null,"space",1,1,1]
[null,"space",1,1,1]
[null,"space",1,1,1]
[null,"space",1,1,1]
[null,"space",1,1,1]
[null,"space",1,1,1]
[null,"space",1,1,1]
[null,"space",1,1,1]
[null,"space",1,1,1]
[null,"space",1,1,1]
[null,"space",1,1,1]
[null,"space",1,1,1]
[null,"space",1,1,1]
[null,"space",1,1,1]
[null,"space",1,1,1]
[null,"space",1,1,1]
[null,"space",1,1,1]
[null,"space",1,1,1]
[null,"space",1,1,1]
[null,"space",1,1,1]
[null,"space",1,1,1]
[null,"space",1,1,1]
[null,"space",1,1,1]
[null,"space",1,1,1]
[null,"space",1,1,1]
[null,"space",1,1,1]
[null,"space",1,1,1]
[null,"space",1,1,1]
[null,"space",1,1,1]
[null,"space",1,1,1]
[null,"space",{"$f":"IFERROR(FIND(A2882,\" \",1),0)","v":1},{"$f":"IFERROR(FIND(A2882,\"1234567890\",1),0)","v":1},{"$f":"IFERROR(FIND(A2882,\".,\",1),0)","v":1}]
[null,"space",1,1,1]
[null,"space",1,1,1]
[null,"space",1,1,1]
[null,"space",1,1,1]
[null,"space",1,1,1]
[null,"space",1,1,1]
[null,"space",1,1,1]
[null,"space",1,1,1]
[null,"space",1,1,1]
[null,"space",1,1,1]
[null,"space",1,1,1]
[null,"space",1,1,1]
[null,"space",1,1,1]
[null,"space",1,1,1]
[null,"space",1,1,1]
[null,"space",1,1,1]
[null,"space",1,1,1]
[null,{"$f":"IF((C2900 > 0),\"space\",(IF((D2900 > 0),\"num\",(IF((E2900 > 0),\"punch\",\"text\")))))","v":"space"},1,1,1]
[null,"space",1,1,1]
[null,"space",1,1,1]
[null,"space",1,1,1]
[null,"space",1,1,1]
[null,"space",1,1,1]
[null,"space",1,1,1]
[null,"space",1,1,1]
[null,"space",1,1,1]
[null,"space",1,1,1]
[null,"space",1,1,1]
[null,"space",1,1,1]
[null,"space",1,1,1]
[null,"space",1,1,1]
[null,"space",1,1,1]
[null,"space",1,1,1]
[null,"space",1,1,1]
[null,"space",1,1,1]
[null,"space",1,1,1]
[null,"space",1,1,1]
[null,"space",1,1,1]
[null,"space",1,1,1]
[null,"space",1,1,1]
[null,"space",1,1,1]
[null,"space",1,1,1]
[null,"space",1,1,1]
[null,"space",1,1,1]
[null,"space",1,1,1]
[null,"space",1,1,1]
[null,"space",1,1,1]
[null,"space",1,1,1]
[null,"space",1,1,1]
[null,"space",1,1,1]
[null,"space",1,1,1]
[null,"space",1,1,1]
[null,"space",1,1,1]
[null,"space",1,1,1]
[null,"space",1,1,1]
[null,"space",1,1,1]
[null,"space",1,1,1]
[null,"space",1,1,1]
[null,"space",1,1,1]
[null,"space",1,1,1]
[null,"space",1,1,1]
[null,"space",1,1,1]
[null,"space",1,1,1]
[null,"space",{"$f":"IFERROR(FIND(A2946,\" \",1),0)","v":1},{"$f":"IFERROR(FIND(A2946,\"1234567890\",1),0)","v":1},{"$f":"IFERROR(FIND(A2946,\".,\",1),0)","v":1}]
[null,"space",1,1,1]
[null,"space",1,1,1]
[null,"space",1,1,1]
[null,"space",1,1,1]
[null,"space",1,1,1]
[null,"space",1,1,1]
[null,"space",1,1,1]
[null,"space",1,1,1]
[null,"space",1,1,1]
[null,"space",1,1,1]
[null,"space",1,1,1]
[null,"space",1,1,1]
[null,"space",1,1,1]
[null,"space",1,1,1]
[null,"space",1,1,1]
[null,"space",1,1,1]
[null,"space",1,1,1]
[null,{"$f":"IF((C2964 > 0),\"space\",(IF((D2964 > 0),\"num\",(IF((E2964 > 0),\"punch\",\"text\")))))","v":"space"},1,1,1]
[null,"space",1,1,1]
[null,"space",1,1,1]
[null,"space",1,1,1]
[null,"space",1,1,1]
[null,"space",1,1,1]
[null,"space",1,1,1]
[null,"space",1,1,1]
[null,"space",1,1,1]
[null,"space",1,1,1]
[null,"space",1,1,1]
[null,"space",1,1,1]
[null,"space",1,1,1]
[null,"space",1,1,1]
[null,"space",1,1,1]
[null,"space",1,1,1]
[null,"space",1,1,1]
[null,"space",1,1,1]
[null,"space",1,1,1]
[null,"space",1,1,1]
[null,"space",1,1,1]
[null,"space",1,1,1]
[null,"space",1,1,1]
[null,"space",1,1,1]
[null,"space",1,1,1]
[null,"space",1,1,1]
[null,"space",1,1,1]
[null,"space",1,1,1]
[null,"space",1,1,1]
[null,"space",1,1,1]
[null,"space",1,1,1]
[null,"space",1,1,1]
[null,"space",1,1,1]
[null,"space",1,1,1]
[null,"space",1,1,1]
[null,"space",1,1,1]
[null,"space",1,1,1]
[null,"space",1,1,1]
[null,"space",1,1,1]
[null,"space",1,1,1]
[null,"space",1,1,1]
[null,"space",1,1,1]
[null,"space",1,1,1]
[null,"space",1,1,1]
[null,"space",1,1,1]
[null,"space",1,1,1]
[null,"space",{"$f":"IFERROR(FIND(A3010,\" \",1),0)","v":1},{"$f":"IFERROR(FIND(A3010,\"1234567890\",1),0)","v":1},{"$f":"IFERROR(FIND(A3010,\".,\",1),0)","v":1}]
[null,"space",1,1,1]
[null,"space",1,1,1]
[null,"space",1,1,1]
[null,"space",1,1,1]
[null,"space",1,1,1]
[null,"space",1,1,1]
[null,"space",1,1,1]
[null,"space",1,1,1]
[null,"space",1,1,1]
[null,"space",1,1,1]
[null,"space",1,1,1]
[null,"space",1,1,1]
[null,"space",1,1,1]
[null,"space",1,1,1]
[null,"space",1,1,1]
[null,"space",1,1,1]
[null,"space",1,1,1]
[null,{"$f":"IF((C3028 > 0),\"space\",(IF((D3028 > 0),\"num\",(IF((E3028 > 0),\"punch\",\"text\")))))","v":"space"},1,1,1]
[null,"space",1,1,1]
[null,"space",1,1,1]
[null,"space",1,1,1]
[null,"space",1,1,1]
[null,"space",1,1,1]
[null,"space",1,1,1]
[null,"space",1,1,1]
[null,"space",1,1,1]
[null,"space",1,1,1]
[null,"space",1,1,1]
[null,"space",1,1,1]
[null,"space",1,1,1]
[null,"space",1,1,1]
[null,"space",1,1,1]
[null,"space",1,1,1]
[null,"space",1,1,1]
[null,"space",1,1,1]
[null,"space",1,1,1]
[null,"space",1,1,1]
[null,"space",1,1,1]
[null,"space",1,1,1]
[null,"space",1,1,1]
[null,"space",1,1,1]
[null,"space",1,1,1]
[null,"space",1,1,1]
[null,"space",1,1,1]
[null,"space",1,1,1]
[null,"space",1,1,1]
[null,"space",1,1,1]
[null,"space",1,1,1]
[null,"space",1,1,1]
[null,"space",1,1,1]
[null,"space",1,1,1]
[null,"space",1,1,1]
[null,"space",1,1,1]
[null,"space",1,1,1]
[null,"space",1,1,1]
[null,"space",1,1,1]
[null,"space",1,1,1]
[null,"space",1,1,1]
[null,"space",1,1,1]
[null,"space",1,1,1]
[null,"space",1,1,1]
[null,"space",1,1,1]
[null,"space",1,1,1]
[null,"space",{"$f":"IFERROR(FIND(A3074,\" \",1),0)","v":1},{"$f":"IFERROR(FIND(A3074,\"1234567890\",1),0)","v":1},{"$f":"IFERROR(FIND(A3074,\".,\",1),0)","v":1}]
[null,"space",1,1,1]
[null,"space",1,1,1]
[null,"space",1,1,1]
[null,"space",1,1,1]
[null,"space",1,1,1]
[null,"space",1,1,1]
[null,"space",1,1,1]
[null,"space",1,1,1]
[null,"space",1,1,1]
[null,"space",1,1,1]
[null,"space",1,1,1]
[null,"space",1,1,1]
[null,"space",1,1,1]
[null,"space",1,1,1]
[null,"space",1,1,1]
[null,"space",1,1,1]
[null,"space",1,1,1]
[null,{"$f":"IF((C3092 > 0),\"space\",(IF((D3092 > 0),\"num\",(IF((E3092 > 0),\"punch\",\"text\")))))","v":"space"},1,1,1]
[null,"space",1,1,1]
[null,"space",1,1,1]
[null,"space",1,1,1]
[null,"space",1,1,1]
[null,"space",1,1,1]
[null,"space",1,1,1]
[null,"space",1,1,1]
[null,"space",1,1,1]
[null,"space",1,1,1]
[null,"space",1,1,1]
[null,"space",1,1,1]
[null,"space",1,1,1]
[null,"space",1,1,1]
[null,"space",1,1,1]
[null,"space",1,1,1]
[null,"space",1,1,1]
[null,"space",1,1,1]
[null,"space",1,1,1]
[null,"space",1,1,1]
[null,"space",1,1,1]
[null,"space",1,1,1]
[null,"space",1,1,1]
[null,"space",1,1,1]
[null,"space",1,1,1]
[null,"space",1,1,1]
[null,"space",1,1,1]
[null,"space",1,1,1]
[null,"space",1,1,1]
[null,"space",1,1,1]
[null,"space",1,1,1]
[null,"space",1,1,1]
[null,"space",1,1,1]
[null,"space",1,1,1]
[null,"space",1,1,1]
[null,"space",1,1,1]
[null,"space",1,1,1]
[null,"space",1,1,1]
[null,"space",1,1,1]
[null,"space",1,1,1]
[null,"space",1,1,1]
[null,"space",1,1,1]
[null,"space",1,1,1]
[null,"space",1,1,1]
[null,"space",1,1,1]
[null,"space",1,1,1]
[null,"space",{"$f":"IFERROR(FIND(A3138,\" \",1),0)","v":1},{"$f":"IFERROR(FIND(A3138,\"1234567890\",1),0)","v":1},{"$f":"IFERROR(FIND(A3138,\".,\",1),0)","v":1}]
[null,"space",1,1,1]
[null,"space",1,1,1]
[null,"space",1,1,1]
[null,"space",1,1,1]
[null,"space",1,1,1]
[null,"space",1,1,1]
[null,"space",1,1,1]
[null,"space",1,1,1]
[null,"space",1,1,1]
[null,"space",1,1,1]
[null,"space",1,1,1]
[null,"space",1,1,1]
[null,"space",1,1,1]
[null,"space",1,1,1]
[null,"space",1,1,1]
[null,"space",1,1,1]
[null,"space",1,1,1]
[null,{"$f":"IF((C3156 > 0),\"space\",(IF((D3156 > 0),\"num\",(IF((E3156 > 0),\"punch\",\"text\")))))","v":"space"},1,1,1]
[null,"space",1,1,1]
[null,"space",1,1,1]
[null,"space",1,1,1]
[null,"space",1,1,1]
[null,"space",1,1,1]
[null,"space",1,1,1]
[null,"space",1,1,1]
[null,"space",1,1,1]
[null,"space",1,1,1]
[null,"space",1,1,1]
[null,"space",1,1,1]
[null,"space",1,1,1]
[null,"space",1,1,1]
[null,"space",1,1,1]
[null,"space",1,1,1]
[null,"space",1,1,1]
[null,"space",1,1,1]
[null,"space",1,1,1]
[null,"space",1,1,1]
[null,"space",1,1,1]
[null,"space",1,1,1]
[null,"space",1,1,1]
[null,"space",1,1,1]
[null,"space",1,1,1]
[null,"space",1,1,1]
[null,"space",1,1,1]
[null,"space",1,1,1]
[null,"space",1,1,1]
[null,"space",1,1,1]
[null,"space",1,1,1]
[null,"space",1,1,1]
[null,"space",1,1,1]
[null,"space",1,1,1]
[null,"space",1,1,1]
[null,"space",1,1,1]
[null,"space",1,1,1]
[null,"space",1,1,1]
[null,"space",1,1,1]
[null,"space",1,1,1]
[null,"space",1,1,1]
[null,"space",1,1,1]
[null,"space",1,1,1]
[null,"space",1,1,1]
[null,"space",1,1,1]
[null,"space",1,1,1]
[null,"space",{"$f":"IFERROR(FIND(A3202,\" \",1),0)","v":1},{"$f":"IFERROR(FIND(A3202,\"1234567890\",1),0)","v":1},{"$f":"IFERROR(FIND(A3202,\".,\",1),0)","v":1}]
[null,"space",1,1,1]
[null,"space",1,1,1]
[null,"space",1,1,1]
[null,"space",1,1,1]
[null,"space",1,1,1]
[null,"space",1,1,1]
[null,"space",1,1,1]
[null,"space",1,1,1]
[null,"space",1,1,1]
[null,"space",1,1,1]
[null,"space",1,1,1]
[null,"space",1,1,1]
[null,"space",1,1,1]
[null,"space",1,1,1]
[null,"space",1,1,1]
[null,"space",1,1,1]
[null,"space",1,1,1]
[null,{"$f":"IF((C3220 > 0),\"space\",(IF((D3220 > 0),\"num\",(IF((E3220 > 0),\"punch\",\"text\")))))","v":"space"},1,1,1]
[null,"space",1,1,1]
[null,"space",1,1,1]
[null,"space",1,1,1]
[null,"space",1,1,1]
[null,"space",1,1,1]
[null,"space",1,1,1]
[null,"space",1,1,1]
[null,"space",1,1,1]
[null,"space",1,1,1]
[null,"space",1,1,1]
[null,"space",1,1,1]
[null,"space",1,1,1]
[null,"space",1,1,1]
[null,"space",1,1,1]
[null,"space",1,1,1]
[null,"space",1,1,1]
[null,"space",1,1,1]
[null,"space",1,1,1]
[null,"space",1,1,1]
[null,"space",1,1,1]
[null,"space",1,1,1]
[null,"space",1,1,1]
[null,"space",1,1,1]
[null,"space",1,1,1]
[null,"space",1,1,1]
[null,"space",1,1,1]
[null,"space",1,1,1]
[null,"space",1,1,1]
[null,"space",1,1,1]
[null,"space",1,1,1]
[null,"space",1,1,1]
[null,"space",1,1,1]
[null,"space",1,1,1]
[null,"space",1,1,1]
[null,"space",1,1,1]
[null,"space",1,1,1]
[null,"space",1,1,1]
[null,"space",1,1,1]
[null,"space",1,1,1]
[null,"space",1,1,1]
[null,"space",1,1,1]
[null,"space",1,1,1]
[null,"space",1,1,1]
[null,"space",1,1,1]
[null,"space",1,1,1]
[null,"space",{"$f":"IFERROR(FIND(A3266,\" \",1),0)","v":1},{"$f":"IFERROR(FIND(A3266,\"1234567890\",1),0)","v":1},{"$f":"IFERROR(FIND(A3266,\".,\",1),0)","v":1}]
[null,"space",1,1,1]
[null,"space",1,1,1]
[null,"space",1,1,1]
[null,"space",1,1,1]
[null,"space",1,1,1]
[null,"space",1,1,1]
[null,"space",1,1,1]
[null,"space",1,1,1]
[null,"space",1,1,1]
[null,"space",1,1,1]
[null,"space",1,1,1]
[null,"space",1,1,1]
[null,"space",1,1,1]
[null,"space",1,1,1]
[null,"space",1,1,1]
[null,"space",1,1,1]
[null,"space",1,1,1]
[null,{"$f":"IF((C3284 > 0),\"space\",(IF((D3284 > 0),\"num\",(IF((E3284 > 0),\"punch\",\"text\")))))","v":"space"},1,1,1]
[null,"space",1,1,1]
[null,"space",1,1,1]
[null,"space",1,1,1]
[null,"space",1,1,1]
[null,"space",1,1,1]
[null,"space",1,1,1]
[null,"space",1,1,1]
[null,"space",1,1,1]
[null,"space",1,1,1]
[null,"space",1,1,1]
[null,"space",1,1,1]
[null,"space",1,1,1]
[null,"space",1,1,1]
[null,"space",1,1,1]
[null,"space",1,1,1]
[null,"space",1,1,1]
[null,"space",1,1,1]
[null,"space",1,1,1]
[null,"space",1,1,1]
[null,"space",1,1,1]
[null,"space",1,1,1]
[null,"space",1,1,1]
[null,"space",1,1,1]
[null,"space",1,1,1]
[null,"space",1,1,1]
[null,"space",1,1,1]
[null,"space",1,1,1]
[null,"space",1,1,1]

{"sheet":"GreekWords","index":5,"n_rows":7,"n_cols":2,"rows_kept":7,"cut":false,"hidden":false,"merged":[]}
[1,"Βίβλος"]
[2,"ἐγέννησ"]
[2,"Δαυὶδ"]
[2,"δὲ"]
[2,"ἐγέννησεν"]
[2,"τὸν"]
[3]

{"sheet":"Parse2 (2)","index":6,"n_rows":3312,"n_cols":5,"rows_kept":3312,"cut":false,"hidden":false,"merged":[]}
[1,{"$f":"IF((C1 > 0),\"space\",(IF((D1 > 0),\"num\",(IF((E1 > 0),\"punch\",\"text\")))))","v":"num"},{"$f":"IFERROR(FIND(A1,\" \",1),0)","v":0},{"$f":"IFERROR(FIND(A1,\"1234567890\",1),0)","v":1},{"$f":"IFERROR(FIND(A1,\".\",1),0)","v":0}]
["Β",{"$f":"IF((C2 > 0),\"space\",(IF((D2 > 0),\"num\",(IF((E2 > 0),\"punch\",\"text\")))))","v":"text"},{"$f":"IFERROR(FIND(A2,\" \",1),0)","v":0},{"$f":"IFERROR(FIND(A2,\"1234567890\",1),0)","v":0},{"$f":"IFERROR(FIND(A2,\".\",1),0)","v":0}]
["ί","text",0,0,0]
["β","text",0,0,0]
["λ","text",0,0,0]
["ο","text",0,0,0]
["ς","text",0,0,0]
[" ","space",1,0,0]
["γ","text",0,0,0]
["ε","text",0,0,0]
["ν","text",0,0,0]
["έ","text",0,0,0]
["σ","text",0,0,0]
["ε","text",0,0,0]
["ω","text",0,0,0]
["ς","text",0,0,0]
[" ","space",1,0,0]
["Ἰ","text",0,0,0]
["η","text",0,0,0]
["σ","text",0,0,0]
["ο","text",0,0,0]
["ῦ","text",0,0,0]
[" ","space",1,0,0]
["Χ","text",0,0,0]
["ρ","text",0,0,0]
["ι","text",0,0,0]
["σ","text",0,0,0]
["τ","text",0,0,0]
["ο","text",0,0,0]
["ῦ","text",0,0,0]
[" ","space",1,0,0]
["υ","text",0,0,0]
["ἱ","text",0,0,0]
["ο","text",0,0,0]
["ῦ","text",0,0,0]
[null,"space",1,1,1]
[null,"space",1,1,1]
[null,"space",1,1,1]
[null,"space",1,1,1]
[null,"space",1,1,1]
[null,"space",1,1,1]
[null,"space",1,1,1]
[null,"space",1,1,1]
[null,"space",1,1,1]
[null,"space",1,1,1]
[null,"space",1,1,1]
[null,"space",1,1,1]
[null,"space",1,1,1]
[null,"space",1,1,1]
[null,"space",1,1,1]
[null,"space",1,1,1]
[null,"space",1,1,1]
[null,"space",1,1,1]
[null,"space",1,1,1]
[null,"space",1,1,1]
[null,"space",1,1,1]
[null,"space",1,1,1]
[null,"space",1,1,1]
[null,"space",1,1,1]
[null,"space",1,1,1]
[null,"space",1,1,1]
[null,"space",1,1,1]
[null,"space",1,1,1]
[null,"space",1,1,1]
[null,"space",1,1,1]
[null,{"$f":"IF((C66 > 0),\"space\",(IF((D66 > 0),\"num\",(IF((E66 > 0),\"punch\",\"text\")))))","v":"space"},{"$f":"IFERROR(FIND(A66,\" \",1),0)","v":1},{"$f":"IFERROR(FIND(A66,\"1234567890\",1),0)","v":1},{"$f":"IFERROR(FIND(A66,\".\",1),0)","v":1}]
[null,"space",1,1,1]
[null,"space",1,1,1]
[null,"space",1,1,1]
[null,"space",1,1,1]
[null,"space",1,1,1]
[null,"space",1,1,1]
[null,"space",1,1,1]
[null,"space",1,1,1]
[null,"space",1,1,1]
[null,"space",1,1,1]
[null,"space",1,1,1]
[null,"space",1,1,1]
[null,"space",1,1,1]
[null,"space",1,1,1]
[null,"space",1,1,1]
[null,"space",1,1,1]
[null,"space",1,1,1]
[null,"space",1,1,1]
[null,"space",1,1,1]
[null,"space",1,1,1]
[null,"space",1,1,1]
[null,"space",1,1,1]
[null,"space",1,1,1]
[null,"space",1,1,1]
[null,"space",1,1,1]
[null,"space",1,1,1]
[null,"space",1,1,1]
[null,"space",1,1,1]
[null,"space",1,1,1]
[null,"space",1,1,1]
[null,"space",1,1,1]
[null,"space",1,1,1]
[null,"space",1,1,1]
[null,"space",1,1,1]
[null,"space",1,1,1]
[null,"space",1,1,1]
[null,"space",1,1,1]
[null,"space",1,1,1]
[null,"space",1,1,1]
[null,"space",1,1,1]
[null,"space",1,1,1]
[null,"space",1,1,1]
[null,"space",1,1,1]
[null,"space",1,1,1]
[null,"space",1,1,1]
[null,"space",1,1,1]
[null,"space",1,1,1]
[null,"space",1,1,1]
[null,"space",1,1,1]
[null,"space",1,1,1]
[null,"space",1,1,1]
[null,"space",1,1,1]
[null,"space",1,1,1]
[null,"space",1,1,1]
[null,"space",1,1,1]
[null,"space",1,1,1]
[null,"space",1,1,1]
[null,"space",1,1,1]
[null,"space",1,1,1]
[null,"space",1,1,1]
[null,"space",1,1,1]
[null,"space",1,1,1]
[null,"space",1,1,1]
[null,{"$f":"IF((C130 > 0),\"space\",(IF((D130 > 0),\"num\",(IF((E130 > 0),\"punch\",\"text\")))))","v":"space"},{"$f":"IFERROR(FIND(A130,\" \",1),0)","v":1},{"$f":"IFERROR(FIND(A130,\"1234567890\",1),0)","v":1},{"$f":"IFERROR(FIND(A130,\".\",1),0)","v":1}]
[null,"space",1,1,1]
[null,"space",1,1,1]
[null,"space",1,1,1]
[null,"space",1,1,1]
[null,"space",1,1,1]
[null,"space",1,1,1]
[null,"space",1,1,1]
[null,"space",1,1,1]
[null,"space",1,1,1]
[null,"space",1,1,1]
[null,"space",1,1,1]
[null,"space",1,1,1]
[null,"space",1,1,1]
[null,"space",1,1,1]
[null,"space",1,1,1]
[null,"space",1,1,1]
[null,"space",1,1,1]
[null,"space",1,1,1]
[null,"space",1,1,1]
[null,"space",1,1,1]
[null,"space",1,1,1]
[null,"space",1,1,1]
[null,"space",1,1,1]
[null,"space",1,1,1]
[null,"space",1,1,1]
[null,"space",1,1,1]
[null,"space",1,1,1]
[null,"space",1,1,1]
[null,"space",1,1,1]
[null,"space",1,1,1]
[null,"space",1,1,1]
[null,"space",1,1,1]
[null,"space",1,1,1]
[null,"space",1,1,1]
[null,"space",1,1,1]
[null,"space",1,1,1]
[null,"space",1,1,1]
[null,"space",1,1,1]
[null,"space",1,1,1]
[null,"space",1,1,1]
[null,"space",1,1,1]
[null,"space",1,1,1]
[null,"space",1,1,1]
[null,"space",1,1,1]
[null,"space",1,1,1]
[null,"space",1,1,1]
[null,"space",1,1,1]
[null,"space",1,1,1]
[null,"space",1,1,1]
[null,"space",1,1,1]
[null,"space",1,1,1]
[null,"space",1,1,1]
[null,"space",1,1,1]
[null,"space",1,1,1]
[null,"space",1,1,1]
[null,"space",1,1,1]
[null,"space",1,1,1]
[null,"space",1,1,1]
[null,"space",1,1,1]
[null,"space",1,1,1]
[null,"space",1,1,1]
[null,"space",1,1,1]
[null,"space",1,1,1]
[null,{"$f":"IF((C194 > 0),\"space\",(IF((D194 > 0),\"num\",(IF((E194 > 0),\"punch\",\"text\")))))","v":"space"},{"$f":"IFERROR(FIND(A194,\" \",1),0)","v":1},{"$f":"IFERROR(FIND(A194,\"1234567890\",1),0)","v":1},{"$f":"IFERROR(FIND(A194,\".\",1),0)","v":1}]
[null,"space",1,1,1]
[null,"space",1,1,1]
[null,"space",1,1,1]
[null,"space",1,1,1]
[null,"space",1,1,1]
[null,"space",1,1,1]
[null,"space",1,1,1]
[null,"space",1,1,1]
[null,"space",1,1,1]
[null,"space",1,1,1]
[null,"space",1,1,1]
[null,"space",1,1,1]
[null,"space",1,1,1]
[null,"space",1,1,1]
[null,"space",1,1,1]
[null,"space",1,1,1]
[null,"space",1,1,1]
[null,"space",1,1,1]
[null,"space",1,1,1]
[null,"space",1,1,1]
[null,"space",1,1,1]
[null,"space",1,1,1]
[null,"space",1,1,1]
[null,"space",1,1,1]
[null,"space",1,1,1]
[null,"space",1,1,1]
[null,"space",1,1,1]
[null,"space",1,1,1]
[null,"space",1,1,1]
[null,"space",1,1,1]
[null,"space",1,1,1]
[null,"space",1,1,1]
[null,"space",1,1,1]
[null,"space",1,1,1]
[null,"space",1,1,1]
[null,"space",1,1,1]
[null,"space",1,1,1]
[null,"space",1,1,1]
[null,"space",1,1,1]
[null,"space",1,1,1]
[null,"space",1,1,1]
[null,"space",1,1,1]
[null,"space",1,1,1]
[null,"space",1,1,1]
[null,"space",1,1,1]
[null,"space",1,1,1]
[null,"space",1,1,1]
[null,"space",1,1,1]
[null,"space",1,1,1]
[null,"space",1,1,1]
[null,"space",1,1,1]
[null,"space",1,1,1]
[null,"space",1,1,1]
[null,"space",1,1,1]
[null,"space",1,1,1]
[null,"space",1,1,1]
[null,"space",1,1,1]
[null,"space",1,1,1]
[null,"space",1,1,1]
[null,"space",1,1,1]
[null,"space",1,1,1]
[null,"space",1,1,1]
[null,"space",1,1,1]
[null,{"$f":"IF((C258 > 0),\"space\",(IF((D258 > 0),\"num\",(IF((E258 > 0),\"punch\",\"text\")))))","v":"space"},{"$f":"IFERROR(FIND(A258,\" \",1),0)","v":1},{"$f":"IFERROR(FIND(A258,\"1234567890\",1),0)","v":1},{"$f":"IFERROR(FIND(A258,\".\",1),0)","v":1}]
[null,"space",1,1,1]
[null,"space",1,1,1]
[null,"space",1,1,1]
[null,"space",1,1,1]
[null,"space",1,1,1]
[null,"space",1,1,1]
[null,"space",1,1,1]
[null,"space",1,1,1]
[null,"space",1,1,1]
[null,"space",1,1,1]
[null,"space",1,1,1]
[null,"space",1,1,1]
[null,"space",1,1,1]
[null,"space",1,1,1]
[null,"space",1,1,1]
[null,"space",1,1,1]
[null,"space",1,1,1]
[null,"space",1,1,1]
[null,"space",1,1,1]
[null,"space",1,1,1]
[null,"space",1,1,1]
[null,"space",1,1,1]
[null,"space",1,1,1]
[null,"space",1,1,1]
[null,"space",1,1,1]
[null,"space",1,1,1]
[null,"space",1,1,1]
[null,"space",1,1,1]
[null,"space",1,1,1]
[null,"space",1,1,1]
[null,"space",1,1,1]
[null,"space",1,1,1]
[null,"space",1,1,1]
[null,"space",1,1,1]
[null,"space",1,1,1]
[null,"space",1,1,1]
[null,"space",1,1,1]
[null,"space",1,1,1]
[null,"space",1,1,1]
[null,"space",1,1,1]
[null,"space",1,1,1]
[null,"space",1,1,1]
[null,"space",1,1,1]
[null,"space",1,1,1]
[null,"space",1,1,1]
[null,"space",1,1,1]
[null,"space",1,1,1]
[null,"space",1,1,1]
[null,"space",1,1,1]
[null,"space",1,1,1]
[null,"space",1,1,1]
[null,"space",1,1,1]
[null,"space",1,1,1]
[null,"space",1,1,1]
[null,"space",1,1,1]
[null,"space",1,1,1]
[null,"space",1,1,1]
[null,"space",1,1,1]
[null,"space",1,1,1]
[null,"space",1,1,1]
[null,"space",1,1,1]
[null,"space",1,1,1]
[null,"space",1,1,1]
[null,{"$f":"IF((C322 > 0),\"space\",(IF((D322 > 0),\"num\",(IF((E322 > 0),\"punch\",\"text\")))))","v":"space"},{"$f":"IFERROR(FIND(A322,\" \",1),0)","v":1},{"$f":"IFERROR(FIND(A322,\"1234567890\",1),0)","v":1},{"$f":"IFERROR(FIND(A322,\".\",1),0)","v":1}]
[null,"space",1,1,1]
[null,"space",1,1,1]
[null,"space",1,1,1]
[null,"space",1,1,1]
[null,"space",1,1,1]
[null,"space",1,1,1]
[null,"space",1,1,1]
[null,"space",1,1,1]
[null,"space",1,1,1]
[null,"space",1,1,1]
[null,"space",1,1,1]
[null,"space",1,1,1]
[null,"space",1,1,1]
[null,"space",1,1,1]
[null,"space",1,1,1]
[null,"space",1,1,1]
[null,"space",1,1,1]
[null,"space",1,1,1]
[null,"space",1,1,1]
[null,"space",1,1,1]
[null,"space",1,1,1]
[null,"space",1,1,1]
[null,"space",1,1,1]
[null,"space",1,1,1]
[null,"space",1,1,1]
[null,"space",1,1,1]
[null,"space",1,1,1]
[null,"space",1,1,1]
[null,"space",1,1,1]
[null,"space",1,1,1]
[null,"space",1,1,1]
[null,"space",1,1,1]
[null,"space",1,1,1]
[null,"space",1,1,1]
[null,"space",1,1,1]
[null,"space",1,1,1]
[null,"space",1,1,1]
[null,"space",1,1,1]
[null,"space",1,1,1]
[null,"space",1,1,1]
[null,"space",1,1,1]
[null,"space",1,1,1]
[null,"space",1,1,1]
[null,"space",1,1,1]
[null,"space",1,1,1]
[null,"space",1,1,1]
[null,"space",1,1,1]
[null,"space",1,1,1]
[null,"space",1,1,1]
[null,"space",1,1,1]
[null,"space",1,1,1]
[null,"space",1,1,1]
[null,"space",1,1,1]
[null,"space",1,1,1]
[null,"space",1,1,1]
[null,"space",1,1,1]
[null,"space",1,1,1]
[null,"space",1,1,1]
[null,"space",1,1,1]
[null,"space",1,1,1]
[null,"space",1,1,1]
[null,"space",1,1,1]
[null,"space",1,1,1]
[null,{"$f":"IF((C386 > 0),\"space\",(IF((D386 > 0),\"num\",(IF((E386 > 0),\"punch\",\"text\")))))","v":"space"},{"$f":"IFERROR(FIND(A386,\" \",1),0)","v":1},{"$f":"IFERROR(FIND(A386,\"1234567890\",1),0)","v":1},{"$f":"IFERROR(FIND(A386,\".\",1),0)","v":1}]
[null,"space",1,1,1]
[null,"space",1,1,1]
[null,"space",1,1,1]
[null,"space",1,1,1]
[null,"space",1,1,1]
[null,"space",1,1,1]
[null,"space",1,1,1]
[null,"space",1,1,1]
[null,"space",1,1,1]
[null,"space",1,1,1]
[null,"space",1,1,1]
[null,"space",1,1,1]
[null,"space",1,1,1]
[null,"space",1,1,1]
[null,"space",1,1,1]
[null,"space",1,1,1]
[null,"space",1,1,1]
[null,"space",1,1,1]
[null,"space",1,1,1]
[null,"space",1,1,1]
[null,"space",1,1,1]
[null,"space",1,1,1]
[null,"space",1,1,1]
[null,"space",1,1,1]
[null,"space",1,1,1]
[null,"space",1,1,1]
[null,"space",1,1,1]
[null,"space",1,1,1]
[null,"space",1,1,1]
[null,"space",1,1,1]
[null,"space",1,1,1]
[null,"space",1,1,1]
[null,"space",1,1,1]
[null,"space",1,1,1]
[null,"space",1,1,1]
[null,"space",1,1,1]
[null,"space",1,1,1]
[null,"space",1,1,1]
[null,"space",1,1,1]
[null,"space",1,1,1]
[null,"space",1,1,1]
[null,"space",1,1,1]
[null,"space",1,1,1]
[null,"space",1,1,1]
[null,"space",1,1,1]
[null,"space",1,1,1]
[null,"space",1,1,1]
[null,"space",1,1,1]
[null,"space",1,1,1]
[null,"space",1,1,1]
[null,"space",1,1,1]
[null,"space",1,1,1]
[null,"space",1,1,1]
[null,"space",1,1,1]
[null,"space",1,1,1]
[null,"space",1,1,1]
[null,"space",1,1,1]
[null,"space",1,1,1]
[null,"space",1,1,1]
[null,"space",1,1,1]
[null,"space",1,1,1]
[null,"space",1,1,1]
[null,"space",1,1,1]
[null,{"$f":"IF((C450 > 0),\"space\",(IF((D450 > 0),\"num\",(IF((E450 > 0),\"punch\",\"text\")))))","v":"space"},{"$f":"IFERROR(FIND(A450,\" \",1),0)","v":1},{"$f":"IFERROR(FIND(A450,\"1234567890\",1),0)","v":1},{"$f":"IFERROR(FIND(A450,\".\",1),0)","v":1}]
[null,"space",1,1,1]
[null,"space",1,1,1]
[null,"space",1,1,1]
[null,"space",1,1,1]
[null,"space",1,1,1]
[null,"space",1,1,1]
[null,"space",1,1,1]
[null,"space",1,1,1]
[null,"space",1,1,1]
[null,"space",1,1,1]
[null,"space",1,1,1]
[null,"space",1,1,1]
[null,"space",1,1,1]
[null,"space",1,1,1]
[null,"space",1,1,1]
[null,"space",1,1,1]
[null,"space",1,1,1]
[null,"space",1,1,1]
[null,"space",1,1,1]
[null,"space",1,1,1]
[null,"space",1,1,1]
[null,"space",1,1,1]
[null,"space",1,1,1]
[null,"space",1,1,1]
[null,"space",1,1,1]
[null,"space",1,1,1]
[null,"space",1,1,1]
[null,"space",1,1,1]
[null,"space",1,1,1]
[null,"space",1,1,1]
[null,"space",1,1,1]
[null,"space",1,1,1]
[null,"space",1,1,1]
[null,"space",1,1,1]
[null,"space",1,1,1]
[null,"space",1,1,1]
[null,"space",1,1,1]
[null,"space",1,1,1]
[null,"space",1,1,1]
[null,"space",1,1,1]
[null,"space",1,1,1]
[null,"space",1,1,1]
[null,"space",1,1,1]
[null,"space",1,1,1]
[null,"space",1,1,1]
[null,"space",1,1,1]
[null,"space",1,1,1]
[null,"space",1,1,1]
[null,"space",1,1,1]
[null,"space",1,1,1]
[null,"space",1,1,1]
[null,"space",1,1,1]
[null,"space",1,1,1]
[null,"space",1,1,1]
[null,"space",1,1,1]
[null,"space",1,1,1]
[null,"space",1,1,1]
[null,"space",1,1,1]
[null,"space",1,1,1]
[null,"space",1,1,1]
[null,"space",1,1,1]
[null,"space",1,1,1]
[null,"space",1,1,1]
[null,{"$f":"IF((C514 > 0),\"space\",(IF((D514 > 0),\"num\",(IF((E514 > 0),\"punch\",\"text\")))))","v":"space"},{"$f":"IFERROR(FIND(A514,\" \",1),0)","v":1},{"$f":"IFERROR(FIND(A514,\"1234567890\",1),0)","v":1},{"$f":"IFERROR(FIND(A514,\".\",1),0)","v":1}]
[null,"space",1,1,1]
[null,"space",1,1,1]
[null,"space",1,1,1]
[null,"space",1,1,1]
[null,"space",1,1,1]
[null,"space",1,1,1]
[null,"space",1,1,1]
[null,"space",1,1,1]
[null,"space",1,1,1]
[null,"space",1,1,1]
[null,"space",1,1,1]
[null,"space",1,1,1]
[null,"space",1,1,1]
[null,"space",1,1,1]
[null,"space",1,1,1]
[null,"space",1,1,1]
[null,"space",1,1,1]
[null,"space",1,1,1]
[null,"space",1,1,1]
[null,"space",1,1,1]
[null,"space",1,1,1]
[null,"space",1,1,1]
[null,"space",1,1,1]
[null,"space",1,1,1]
[null,"space",1,1,1]
[null,"space",1,1,1]
[null,"space",1,1,1]
[null,"space",1,1,1]
[null,"space",1,1,1]
[null,"space",1,1,1]
[null,"space",1,1,1]
[null,"space",1,1,1]
[null,"space",1,1,1]
[null,"space",1,1,1]
[null,"space",1,1,1]
[null,"space",1,1,1]
[null,"space",1,1,1]
[null,"space",1,1,1]
[null,"space",1,1,1]
[null,"space",1,1,1]
[null,"space",1,1,1]
[null,"space",1,1,1]
[null,"space",1,1,1]
[null,"space",1,1,1]
[null,"space",1,1,1]
[null,"space",1,1,1]
[null,"space",1,1,1]
[null,"space",1,1,1]
[null,"space",1,1,1]
[null,"space",1,1,1]
[null,"space",1,1,1]
[null,"space",1,1,1]
[null,"space",1,1,1]
[null,"space",1,1,1]
[null,"space",1,1,1]
[null,"space",1,1,1]
[null,"space",1,1,1]
[null,"space",1,1,1]
[null,"space",1,1,1]
[null,"space",1,1,1]
[null,"space",1,1,1]
[null,"space",1,1,1]
[null,"space",1,1,1]
[null,{"$f":"IF((C578 > 0),\"space\",(IF((D578 > 0),\"num\",(IF((E578 > 0),\"punch\",\"text\")))))","v":"space"},{"$f":"IFERROR(FIND(A578,\" \",1),0)","v":1},{"$f":"IFERROR(FIND(A578,\"1234567890\",1),0)","v":1},{"$f":"IFERROR(FIND(A578,\".\",1),0)","v":1}]
[null,"space",1,1,1]
[null,"space",1,1,1]
[null,"space",1,1,1]
[null,"space",1,1,1]
[null,"space",1,1,1]
[null,"space",1,1,1]
[null,"space",1,1,1]
[null,"space",1,1,1]
[null,"space",1,1,1]
[null,"space",1,1,1]
[null,"space",1,1,1]
[null,"space",1,1,1]
[null,"space",1,1,1]
[null,"space",1,1,1]
[null,"space",1,1,1]
[null,"space",1,1,1]
[null,"space",1,1,1]
[null,"space",1,1,1]
[null,"space",1,1,1]
[null,"space",1,1,1]
[null,"space",1,1,1]
[null,"space",1,1,1]
[null,"space",1,1,1]
[null,"space",1,1,1]
[null,"space",1,1,1]
[null,"space",1,1,1]
[null,"space",1,1,1]
[null,"space",1,1,1]
[null,"space",1,1,1]
[null,"space",1,1,1]
[null,"space",1,1,1]
[null,"space",1,1,1]
[null,"space",1,1,1]
[null,"space",1,1,1]
[null,"space",1,1,1]
[null,"space",1,1,1]
[null,"space",1,1,1]
[null,"space",1,1,1]
[null,"space",1,1,1]
[null,"space",1,1,1]
[null,"space",1,1,1]
[null,"space",1,1,1]
[null,"space",1,1,1]
[null,"space",1,1,1]
[null,"space",1,1,1]
[null,"space",1,1,1]
[null,"space",1,1,1]
[null,"space",1,1,1]
[null,"space",1,1,1]
[null,"space",1,1,1]
[null,"space",1,1,1]
[null,"space",1,1,1]
[null,"space",1,1,1]
[null,"space",1,1,1]
[null,"space",1,1,1]
[null,"space",1,1,1]
[null,"space",1,1,1]
[null,"space",1,1,1]
[null,"space",1,1,1]
[null,"space",1,1,1]
[null,"space",1,1,1]
[null,"space",1,1,1]
[null,"space",1,1,1]
[null,{"$f":"IF((C642 > 0),\"space\",(IF((D642 > 0),\"num\",(IF((E642 > 0),\"punch\",\"text\")))))","v":"space"},{"$f":"IFERROR(FIND(A642,\" \",1),0)","v":1},{"$f":"IFERROR(FIND(A642,\"1234567890\",1),0)","v":1},{"$f":"IFERROR(FIND(A642,\".\",1),0)","v":1}]
[null,"space",1,1,1]
[null,"space",1,1,1]
[null,"space",1,1,1]
[null,"space",1,1,1]
[null,"space",1,1,1]
[null,"space",1,1,1]
[null,"space",1,1,1]
[null,"space",1,1,1]
[null,"space",1,1,1]
[null,"space",1,1,1]
[null,"space",1,1,1]
[null,"space",1,1,1]
[null,"space",1,1,1]
[null,"space",1,1,1]
[null,"space",1,1,1]
[null,"space",1,1,1]
[null,"space",1,1,1]
[null,"space",1,1,1]
[null,"space",1,1,1]
[null,"space",1,1,1]
[null,"space",1,1,1]
[null,"space",1,1,1]
[null,"space",1,1,1]
[null,"space",1,1,1]
[null,"space",1,1,1]
[null,"space",1,1,1]
[null,"space",1,1,1]
[null,"space",1,1,1]
[null,"space",1,1,1]
[null,"space",1,1,1]
[null,"space",1,1,1]
[null,"space",1,1,1]
[null,"space",1,1,1]
[null,"space",1,1,1]
[null,"space",1,1,1]
[null,"space",1,1,1]
[null,"space",1,1,1]
[null,"space",1,1,1]
[null,"space",1,1,1]
[null,"space",1,1,1]
[null,"space",1,1,1]
[null,"space",1,1,1]
[null,"space",1,1,1]
[null,"space",1,1,1]
[null,"space",1,1,1]
[null,"space",1,1,1]
[null,"space",1,1,1]
[null,"space",1,1,1]
[null,"space",1,1,1]
[null,"space",1,1,1]
[null,"space",1,1,1]
[null,"space",1,1,1]
[null,"space",1,1,1]
[null,"space",1,1,1]
[null,"space",1,1,1]
[null,"space",1,1,1]
[null,"space",1,1,1]
[null,"space",1,1,1]
[null,"space",1,1,1]
[null,"space",1,1,1]
[null,"space",1,1,1]
[null,"space",1,1,1]
[null,"space",1,1,1]
[null,{"$f":"IF((C706 > 0),\"space\",(IF((D706 > 0),\"num\",(IF((E706 > 0),\"punch\",\"text\")))))","v":"space"},{"$f":"IFERROR(FIND(A706,\" \",1),0)","v":1},{"$f":"IFERROR(FIND(A706,\"1234567890\",1),0)","v":1},{"$f":"IFERROR(FIND(A706,\".\",1),0)","v":1}]
[null,"space",1,1,1]
[null,"space",1,1,1]
[null,"space",1,1,1]
[null,"space",1,1,1]
[null,"space",1,1,1]
[null,"space",1,1,1]
[null,"space",1,1,1]
[null,"space",1,1,1]
[null,"space",1,1,1]
[null,"space",1,1,1]
[null,"space",1,1,1]
[null,"space",1,1,1]
[null,"space",1,1,1]
[null,"space",1,1,1]
[null,"space",1,1,1]
[null,"space",1,1,1]
[null,"space",1,1,1]
[null,"space",1,1,1]
[null,"space",1,1,1]
[null,"space",1,1,1]
[null,"space",1,1,1]
[null,"space",1,1,1]
[null,"space",1,1,1]
[null,"space",1,1,1]
[null,"space",1,1,1]
[null,"space",1,1,1]
[null,"space",1,1,1]
[null,"space",1,1,1]
[null,"space",1,1,1]
[null,"space",1,1,1]
[null,"space",1,1,1]
[null,"space",1,1,1]
[null,"space",1,1,1]
[null,"space",1,1,1]
[null,"space",1,1,1]
[null,"space",1,1,1]
[null,"space",1,1,1]
[null,"space",1,1,1]
[null,"space",1,1,1]
[null,"space",1,1,1]
[null,"space",1,1,1]
[null,"space",1,1,1]
[null,"space",1,1,1]
[null,"space",1,1,1]
[null,"space",1,1,1]
[null,"space",1,1,1]
[null,"space",1,1,1]
[null,"space",1,1,1]
[null,"space",1,1,1]
[null,"space",1,1,1]
[null,"space",1,1,1]
[null,"space",1,1,1]
[null,"space",1,1,1]
[null,"space",1,1,1]
[null,"space",1,1,1]
[null,"space",1,1,1]
[null,"space",1,1,1]
[null,"space",1,1,1]
[null,"space",1,1,1]
[null,"space",1,1,1]
[null,"space",1,1,1]
[null,"space",1,1,1]
[null,"space",1,1,1]
[null,{"$f":"IF((C770 > 0),\"space\",(IF((D770 > 0),\"num\",(IF((E770 > 0),\"punch\",\"text\")))))","v":"space"},{"$f":"IFERROR(FIND(A770,\" \",1),0)","v":1},{"$f":"IFERROR(FIND(A770,\"1234567890\",1),0)","v":1},{"$f":"IFERROR(FIND(A770,\".\",1),0)","v":1}]
[null,"space",1,1,1]
[null,"space",1,1,1]
[null,"space",1,1,1]
[null,"space",1,1,1]
[null,"space",1,1,1]
[null,"space",1,1,1]
[null,"space",1,1,1]
[null,"space",1,1,1]
[null,"space",1,1,1]
[null,"space",1,1,1]
[null,"space",1,1,1]
[null,"space",1,1,1]
[null,"space",1,1,1]
[null,"space",1,1,1]
[null,"space",1,1,1]
[null,"space",1,1,1]
[null,"space",1,1,1]
[null,"space",1,1,1]
[null,"space",1,1,1]
[null,"space",1,1,1]
[null,"space",1,1,1]
[null,"space",1,1,1]
[null,"space",1,1,1]
[null,"space",1,1,1]
[null,"space",1,1,1]
[null,"space",1,1,1]
[null,"space",1,1,1]
[null,"space",1,1,1]
[null,"space",1,1,1]
[null,"space",1,1,1]
[null,"space",1,1,1]
[null,"space",1,1,1]
[null,"space",1,1,1]
[null,"space",1,1,1]
[null,"space",1,1,1]
[null,"space",1,1,1]
[null,"space",1,1,1]
[null,"space",1,1,1]
[null,"space",1,1,1]
[null,"space",1,1,1]
[null,"space",1,1,1]
[null,"space",1,1,1]
[null,"space",1,1,1]
[null,"space",1,1,1]
[null,"space",1,1,1]
[null,"space",1,1,1]
[null,"space",1,1,1]
[null,"space",1,1,1]
[null,"space",1,1,1]
[null,"space",1,1,1]
[null,"space",1,1,1]
[null,"space",1,1,1]
[null,"space",1,1,1]
[null,"space",1,1,1]
[null,"space",1,1,1]
[null,"space",1,1,1]
[null,"space",1,1,1]
[null,"space",1,1,1]
[null,"space",1,1,1]
[null,"space",1,1,1]
[null,"space",1,1,1]
[null,"space",1,1,1]
[null,"space",1,1,1]
[null,{"$f":"IF((C834 > 0),\"space\",(IF((D834 > 0),\"num\",(IF((E834 > 0),\"punch\",\"text\")))))","v":"space"},{"$f":"IFERROR(FIND(A834,\" \",1),0)","v":1},{"$f":"IFERROR(FIND(A834,\"1234567890\",1),0)","v":1},{"$f":"IFERROR(FIND(A834,\".\",1),0)","v":1}]
[null,"space",1,1,1]
[null,"space",1,1,1]
[null,"space",1,1,1]
[null,"space",1,1,1]
[null,"space",1,1,1]
[null,"space",1,1,1]
[null,"space",1,1,1]
[null,"space",1,1,1]
[null,"space",1,1,1]
[null,"space",1,1,1]
[null,"space",1,1,1]
[null,"space",1,1,1]
[null,"space",1,1,1]
[null,"space",1,1,1]
[null,"space",1,1,1]
[null,"space",1,1,1]
[null,"space",1,1,1]
[null,"space",1,1,1]
[null,"space",1,1,1]
[null,"space",1,1,1]
[null,"space",1,1,1]
[null,"space",1,1,1]
[null,"space",1,1,1]
[null,"space",1,1,1]
[null,"space",1,1,1]
[null,"space",1,1,1]
[null,"space",1,1,1]
[null,"space",1,1,1]
[null,"space",1,1,1]
[null,"space",1,1,1]
[null,"space",1,1,1]
[null,"space",1,1,1]
[null,"space",1,1,1]
[null,"space",1,1,1]
[null,"space",1,1,1]
[null,"space",1,1,1]
[null,"space",1,1,1]
[null,"space",1,1,1]
[null,"space",1,1,1]
[null,"space",1,1,1]
[null,"space",1,1,1]
[null,"space",1,1,1]
[null,"space",1,1,1]
[null,"space",1,1,1]
[null,"space",1,1,1]
[null,"space",1,1,1]
[null,"space",1,1,1]
[null,"space",1,1,1]
[null,"space",1,1,1]
[null,"space",1,1,1]
[null,"space",1,1,1]
[null,"space",1,1,1]
[null,"space",1,1,1]
[null,"space",1,1,1]
[null,"space",1,1,1]
[null,"space",1,1,1]
[null,"space",1,1,1]
[null,"space",1,1,1]
[null,"space",1,1,1]
[null,"space",1,1,1]
[null,"space",1,1,1]
[null,"space",1,1,1]
[null,"space",1,1,1]
[null,{"$f":"IF((C898 > 0),\"space\",(IF((D898 > 0),\"num\",(IF((E898 > 0),\"punch\",\"text\")))))","v":"space"},{"$f":"IFERROR(FIND(A898,\" \",1),0)","v":1},{"$f":"IFERROR(FIND(A898,\"1234567890\",1),0)","v":1},{"$f":"IFERROR(FIND(A898,\".\",1),0)","v":1}]
[null,"space",1,1,1]
[null,"space",1,1,1]
[null,"space",1,1,1]
[null,"space",1,1,1]
[null,"space",1,1,1]
[null,"space",1,1,1]
[null,"space",1,1,1]
[null,"space",1,1,1]
[null,"space",1,1,1]
[null,"space",1,1,1]
[null,"space",1,1,1]
[null,"space",1,1,1]
[null,"space",1,1,1]
[null,"space",1,1,1]
[null,"space",1,1,1]
[null,"space",1,1,1]
[null,"space",1,1,1]
[null,"space",1,1,1]
[null,"space",1,1,1]
[null,"space",1,1,1]
[null,"space",1,1,1]
[null,"space",1,1,1]
[null,"space",1,1,1]
[null,"space",1,1,1]
[null,"space",1,1,1]
[null,"space",1,1,1]
[null,"space",1,1,1]
[null,"space",1,1,1]
[null,"space",1,1,1]
[null,"space",1,1,1]
[null,"space",1,1,1]
[null,"space",1,1,1]
[null,"space",1,1,1]
[null,"space",1,1,1]
[null,"space",1,1,1]
[null,"space",1,1,1]
[null,"space",1,1,1]
[null,"space",1,1,1]
[null,"space",1,1,1]
[null,"space",1,1,1]
[null,"space",1,1,1]
[null,"space",1,1,1]
[null,"space",1,1,1]
[null,"space",1,1,1]
[null,"space",1,1,1]
[null,"space",1,1,1]
[null,"space",1,1,1]
[null,"space",1,1,1]
[null,"space",1,1,1]
[null,"space",1,1,1]
[null,"space",1,1,1]
[null,"space",1,1,1]
[null,"space",1,1,1]
[null,"space",1,1,1]
[null,"space",1,1,1]
[null,"space",1,1,1]
[null,"space",1,1,1]
[null,"space",1,1,1]
[null,"space",1,1,1]
[null,"space",1,1,1]
[null,"space",1,1,1]
[null,"space",1,1,1]
[null,"space",1,1,1]
[null,{"$f":"IF((C962 > 0),\"space\",(IF((D962 > 0),\"num\",(IF((E962 > 0),\"punch\",\"text\")))))","v":"space"},{"$f":"IFERROR(FIND(A962,\" \",1),0)","v":1},{"$f":"IFERROR(FIND(A962,\"1234567890\",1),0)","v":1},{"$f":"IFERROR(FIND(A962,\".\",1),0)","v":1}]
[null,"space",1,1,1]
[null,"space",1,1,1]
[null,"space",1,1,1]
[null,"space",1,1,1]
[null,"space",1,1,1]
[null,"space",1,1,1]
[null,"space",1,1,1]
[null,"space",1,1,1]
[null,"space",1,1,1]
[null,"space",1,1,1]
[null,"space",1,1,1]
[null,"space",1,1,1]
[null,"space",1,1,1]
[null,"space",1,1,1]
[null,"space",1,1,1]
[null,"space",1,1,1]
[null,"space",1,1,1]
[null,"space",1,1,1]
[null,"space",1,1,1]
[null,"space",1,1,1]
[null,"space",1,1,1]
[null,"space",1,1,1]
[null,"space",1,1,1]
[null,"space",1,1,1]
[null,"space",1,1,1]
[null,"space",1,1,1]
[null,"space",1,1,1]
[null,"space",1,1,1]
[null,"space",1,1,1]
[null,"space",1,1,1]
[null,"space",1,1,1]
[null,"space",1,1,1]
[null,"space",1,1,1]
[null,"space",1,1,1]
[null,"space",1,1,1]
[null,"space",1,1,1]
[null,"space",1,1,1]
[null,"space",1,1,1]
[null,"space",1,1,1]
[null,"space",1,1,1]
[null,"space",1,1,1]
[null,"space",1,1,1]
[null,"space",1,1,1]
[null,"space",1,1,1]
[null,"space",1,1,1]
[null,"space",1,1,1]
[null,"space",1,1,1]
[null,"space",1,1,1]
[null,"space",1,1,1]
[null,"space",1,1,1]
[null,"space",1,1,1]
[null,"space",1,1,1]
[null,"space",1,1,1]
[null,"space",1,1,1]
[null,"space",1,1,1]
[null,"space",1,1,1]
[null,"space",1,1,1]
[null,"space",1,1,1]
[null,"space",1,1,1]
[null,"space",1,1,1]
[null,"space",1,1,1]
[null,"space",1,1,1]
[null,"space",1,1,1]
[null,{"$f":"IF((C1026 > 0),\"space\",(IF((D1026 > 0),\"num\",(IF((E1026 > 0),\"punch\",\"text\")))))","v":"space"},{"$f":"IFERROR(FIND(A1026,\" \",1),0)","v":1},{"$f":"IFERROR(FIND(A1026,\"1234567890\",1),0)","v":1},{"$f":"IFERROR(FIND(A1026,\".\",1),0)","v":1}]
[null,"space",1,1,1]
[null,"space",1,1,1]
[null,"space",1,1,1]
[null,"space",1,1,1]
[null,"space",1,1,1]
[null,"space",1,1,1]
[null,"space",1,1,1]
[null,"space",1,1,1]
[null,"space",1,1,1]
[null,"space",1,1,1]
[null,"space",1,1,1]
[null,"space",1,1,1]
[null,"space",1,1,1]
[null,"space",1,1,1]
[null,"space",1,1,1]
[null,"space",1,1,1]
[null,"space",1,1,1]
[null,"space",1,1,1]
[null,"space",1,1,1]
[null,"space",1,1,1]
[null,"space",1,1,1]
[null,"space",1,1,1]
[null,"space",1,1,1]
[null,"space",1,1,1]
[null,"space",1,1,1]
[null,"space",1,1,1]
[null,"space",1,1,1]
[null,"space",1,1,1]
[null,"space",1,1,1]
[null,"space",1,1,1]
[null,"space",1,1,1]
[null,"space",1,1,1]
[null,"space",1,1,1]
[null,"space",1,1,1]
[null,"space",1,1,1]
[null,"space",1,1,1]
[null,"space",1,1,1]
[null,"space",1,1,1]
[null,"space",1,1,1]
[null,"space",1,1,1]
[null,"space",1,1,1]
[null,"space",1,1,1]
[null,"space",1,1,1]
[null,"space",1,1,1]
[null,"space",1,1,1]
[null,"space",1,1,1]
[null,"space",1,1,1]
[null,"space",1,1,1]
[null,"space",1,1,1]
[null,"space",1,1,1]
[null,"space",1,1,1]
[null,"space",1,1,1]
[null,"space",1,1,1]
[null,"space",1,1,1]
[null,"space",1,1,1]
[null,"space",1,1,1]
[null,"space",1,1,1]
[null,"space",1,1,1]
[null,"space",1,1,1]
[null,"space",1,1,1]
[null,"space",1,1,1]
[null,"space",1,1,1]
[null,"space",1,1,1]
[null,{"$f":"IF((C1090 > 0),\"space\",(IF((D1090 > 0),\"num\",(IF((E1090 > 0),\"punch\",\"text\")))))","v":"space"},{"$f":"IFERROR(FIND(A1090,\" \",1),0)","v":1},{"$f":"IFERROR(FIND(A1090,\"1234567890\",1),0)","v":1},{"$f":"IFERROR(FIND(A1090,\".\",1),0)","v":1}]
[null,"space",1,1,1]
[null,"space",1,1,1]
[null,"space",1,1,1]
[null,"space",1,1,1]
[null,"space",1,1,1]
[null,"space",1,1,1]
[null,"space",1,1,1]
[null,"space",1,1,1]
[null,"space",1,1,1]
[null,"space",1,1,1]
[null,"space",1,1,1]
[null,"space",1,1,1]
[null,"space",1,1,1]
[null,"space",1,1,1]
[null,"space",1,1,1]
[null,"space",1,1,1]
[null,"space",1,1,1]
[null,"space",1,1,1]
[null,"space",1,1,1]
[null,"space",1,1,1]
[null,"space",1,1,1]
[null,"space",1,1,1]
[null,"space",1,1,1]
[null,"space",1,1,1]
[null,"space",1,1,1]
[null,"space",1,1,1]
[null,"space",1,1,1]
[null,"space",1,1,1]
[null,"space",1,1,1]
[null,"space",1,1,1]
[null,"space",1,1,1]
[null,"space",1,1,1]
[null,"space",1,1,1]
[null,"space",1,1,1]
[null,"space",1,1,1]
[null,"space",1,1,1]
[null,"space",1,1,1]
[null,"space",1,1,1]
[null,"space",1,1,1]
[null,"space",1,1,1]
[null,"space",1,1,1]
[null,"space",1,1,1]
[null,"space",1,1,1]
[null,"space",1,1,1]
[null,"space",1,1,1]
[null,"space",1,1,1]
[null,"space",1,1,1]
[null,"space",1,1,1]
[null,"space",1,1,1]
[null,"space",1,1,1]
[null,"space",1,1,1]
[null,"space",1,1,1]
[null,"space",1,1,1]
[null,"space",1,1,1]
[null,"space",1,1,1]
[null,"space",1,1,1]
[null,"space",1,1,1]
[null,"space",1,1,1]
[null,"space",1,1,1]
[null,"space",1,1,1]
[null,"space",1,1,1]
[null,"space",1,1,1]
[null,"space",1,1,1]
[null,{"$f":"IF((C1154 > 0),\"space\",(IF((D1154 > 0),\"num\",(IF((E1154 > 0),\"punch\",\"text\")))))","v":"space"},{"$f":"IFERROR(FIND(A1154,\" \",1),0)","v":1},{"$f":"IFERROR(FIND(A1154,\"1234567890\",1),0)","v":1},{"$f":"IFERROR(FIND(A1154,\".\",1),0)","v":1}]
[null,"space",1,1,1]
[null,"space",1,1,1]
[null,"space",1,1,1]
[null,"space",1,1,1]
[null,"space",1,1,1]
[null,"space",1,1,1]
[null,"space",1,1,1]
[null,"space",1,1,1]
[null,"space",1,1,1]
[null,"space",1,1,1]
[null,"space",1,1,1]
[null,"space",1,1,1]
[null,"space",1,1,1]
[null,"space",1,1,1]
[null,"space",1,1,1]
[null,"space",1,1,1]
[null,"space",1,1,1]
[null,"space",1,1,1]
[null,"space",1,1,1]
[null,"space",1,1,1]
[null,"space",1,1,1]
[null,"space",1,1,1]
[null,"space",1,1,1]
[null,"space",1,1,1]
[null,"space",1,1,1]
[null,"space",1,1,1]
[null,"space",1,1,1]
[null,"space",1,1,1]
[null,"space",1,1,1]
[null,"space",1,1,1]
[null,"space",1,1,1]
[null,"space",1,1,1]
[null,"space",1,1,1]
[null,"space",1,1,1]
[null,"space",1,1,1]
[null,"space",1,1,1]
[null,"space",1,1,1]
[null,"space",1,1,1]
[null,"space",1,1,1]
[null,"space",1,1,1]
[null,"space",1,1,1]
[null,"space",1,1,1]
[null,"space",1,1,1]
[null,"space",1,1,1]
[null,"space",1,1,1]
[null,"space",1,1,1]
[null,"space",1,1,1]
[null,"space",1,1,1]
[null,"space",1,1,1]
[null,"space",1,1,1]
[null,"space",1,1,1]
[null,"space",1,1,1]
[null,"space",1,1,1]
[null,"space",1,1,1]
[null,"space",1,1,1]
[null,"space",1,1,1]
[null,"space",1,1,1]
[null,"space",1,1,1]
[null,"space",1,1,1]
[null,"space",1,1,1]
[null,"space",1,1,1]
[null,"space",1,1,1]
[null,"space",1,1,1]
[null,{"$f":"IF((C1218 > 0),\"space\",(IF((D1218 > 0),\"num\",(IF((E1218 > 0),\"punch\",\"text\")))))","v":"space"},{"$f":"IFERROR(FIND(A1218,\" \",1),0)","v":1},{"$f":"IFERROR(FIND(A1218,\"1234567890\",1),0)","v":1},{"$f":"IFERROR(FIND(A1218,\".\",1),0)","v":1}]
[null,"space",1,1,1]
[null,"space",1,1,1]
[null,"space",1,1,1]
[null,"space",1,1,1]
[null,"space",1,1,1]
[null,"space",1,1,1]
[null,"space",1,1,1]
[null,"space",1,1,1]
[null,"space",1,1,1]
[null,"space",1,1,1]
[null,"space",1,1,1]
[null,"space",1,1,1]
[null,"space",1,1,1]
[null,"space",1,1,1]
[null,"space",1,1,1]
[null,"space",1,1,1]
[null,"space",1,1,1]
[null,"space",1,1,1]
[null,"space",1,1,1]
[null,"space",1,1,1]
[null,"space",1,1,1]
[null,"space",1,1,1]
[null,"space",1,1,1]
[null,"space",1,1,1]
[null,"space",1,1,1]
[null,"space",1,1,1]
[null,"space",1,1,1]
[null,"space",1,1,1]
[null,"space",1,1,1]
[null,"space",1,1,1]
[null,"space",1,1,1]
[null,"space",1,1,1]
[null,"space",1,1,1]
[null,"space",1,1,1]
[null,"space",1,1,1]
[null,"space",1,1,1]
[null,"space",1,1,1]
[null,"space",1,1,1]
[null,"space",1,1,1]
[null,"space",1,1,1]
[null,"space",1,1,1]
[null,"space",1,1,1]
[null,"space",1,1,1]
[null,"space",1,1,1]
[null,"space",1,1,1]
[null,"space",1,1,1]
[null,"space",1,1,1]
[null,"space",1,1,1]
[null,"space",1,1,1]
[null,"space",1,1,1]
[null,"space",1,1,1]
[null,"space",1,1,1]
[null,"space",1,1,1]
[null,"space",1,1,1]
[null,"space",1,1,1]
[null,"space",1,1,1]
[null,"space",1,1,1]
[null,"space",1,1,1]
[null,"space",1,1,1]
[null,"space",1,1,1]
[null,"space",1,1,1]
[null,"space",1,1,1]
[null,"space",1,1,1]
[null,{"$f":"IF((C1282 > 0),\"space\",(IF((D1282 > 0),\"num\",(IF((E1282 > 0),\"punch\",\"text\")))))","v":"space"},{"$f":"IFERROR(FIND(A1282,\" \",1),0)","v":1},{"$f":"IFERROR(FIND(A1282,\"1234567890\",1),0)","v":1},{"$f":"IFERROR(FIND(A1282,\".\",1),0)","v":1}]
[null,"space",1,1,1]
[null,"space",1,1,1]
[null,"space",1,1,1]
[null,"space",1,1,1]
[null,"space",1,1,1]
[null,"space",1,1,1]
[null,"space",1,1,1]
[null,"space",1,1,1]
[null,"space",1,1,1]
[null,"space",1,1,1]
[null,"space",1,1,1]
[null,"space",1,1,1]
[null,"space",1,1,1]
[null,"space",1,1,1]
[null,"space",1,1,1]
[null,"space",1,1,1]
[null,"space",1,1,1]
[null,"space",1,1,1]
[null,"space",1,1,1]
[null,"space",1,1,1]
[null,"space",1,1,1]
[null,"space",1,1,1]
[null,"space",1,1,1]
[null,"space",1,1,1]
[null,"space",1,1,1]
[null,"space",1,1,1]
[null,"space",1,1,1]
[null,"space",1,1,1]
[null,"space",1,1,1]
[null,"space",1,1,1]
[null,"space",1,1,1]
[null,"space",1,1,1]
[null,"space",1,1,1]
[null,"space",1,1,1]
[null,"space",1,1,1]
[null,"space",1,1,1]
[null,"space",1,1,1]
[null,"space",1,1,1]
[null,"space",1,1,1]
[null,"space",1,1,1]
[null,"space",1,1,1]
[null,"space",1,1,1]
[null,"space",1,1,1]
[null,"space",1,1,1]
[null,"space",1,1,1]
[null,"space",1,1,1]
[null,"space",1,1,1]
[null,"space",1,1,1]
[null,"space",1,1,1]
[null,"space",1,1,1]
[null,"space",1,1,1]
[null,"space",1,1,1]
[null,"space",1,1,1]
[null,"space",1,1,1]
[null,"space",1,1,1]
[null,"space",1,1,1]
[null,"space",1,1,1]
[null,"space",1,1,1]
[null,"space",1,1,1]
[null,"space",1,1,1]
[null,"space",1,1,1]
[null,"space",1,1,1]
[null,"space",1,1,1]
[null,{"$f":"IF((C1346 > 0),\"space\",(IF((D1346 > 0),\"num\",(IF((E1346 > 0),\"punch\",\"text\")))))","v":"space"},{"$f":"IFERROR(FIND(A1346,\" \",1),0)","v":1},{"$f":"IFERROR(FIND(A1346,\"1234567890\",1),0)","v":1},{"$f":"IFERROR(FIND(A1346,\".\",1),0)","v":1}]
[null,"space",1,1,1]
[null,"space",1,1,1]
[null,"space",1,1,1]
[null,"space",1,1,1]
[null,"space",1,1,1]
[null,"space",1,1,1]
[null,"space",1,1,1]
[null,"space",1,1,1]
[null,"space",1,1,1]
[null,"space",1,1,1]
[null,"space",1,1,1]
[null,"space",1,1,1]
[null,"space",1,1,1]
[null,"space",1,1,1]
[null,"space",1,1,1]
[null,"space",1,1,1]
[null,"space",1,1,1]
[null,"space",1,1,1]
[null,"space",1,1,1]
[null,"space",1,1,1]
[null,"space",1,1,1]
[null,"space",1,1,1]
[null,"space",1,1,1]
[null,"space",1,1,1]
[null,"space",1,1,1]
[null,"space",1,1,1]
[null,"space",1,1,1]
[null,"space",1,1,1]
[null,"space",1,1,1]
[null,"space",1,1,1]
[null,"space",1,1,1]
[null,"space",1,1,1]
[null,"space",1,1,1]
[null,"space",1,1,1]
[null,"space",1,1,1]
[null,"space",1,1,1]
[null,"space",1,1,1]
[null,"space",1,1,1]
[null,"space",1,1,1]
[null,"space",1,1,1]
[null,"space",1,1,1]
[null,"space",1,1,1]
[null,"space",1,1,1]
[null,"space",1,1,1]
[null,"space",1,1,1]
[null,"space",1,1,1]
[null,"space",1,1,1]
[null,"space",1,1,1]
[null,"space",1,1,1]
[null,"space",1,1,1]
[null,"space",1,1,1]
[null,"space",1,1,1]
[null,"space",1,1,1]
[null,"space",1,1,1]
[null,"space",1,1,1]
[null,"space",1,1,1]
[null,"space",1,1,1]
[null,"space",1,1,1]
[null,"space",1,1,1]
[null,"space",1,1,1]
[null,"space",1,1,1]
[null,"space",1,1,1]
[null,"space",1,1,1]
[null,{"$f":"IF((C1410 > 0),\"space\",(IF((D1410 > 0),\"num\",(IF((E1410 > 0),\"punch\",\"text\")))))","v":"space"},{"$f":"IFERROR(FIND(A1410,\" \",1),0)","v":1},{"$f":"IFERROR(FIND(A1410,\"1234567890\",1),0)","v":1},{"$f":"IFERROR(FIND(A1410,\".\",1),0)","v":1}]
[null,"space",1,1,1]
[null,"space",1,1,1]
[null,"space",1,1,1]
[null,"space",1,1,1]
[null,"space",1,1,1]
[null,"space",1,1,1]
[null,"space",1,1,1]
[null,"space",1,1,1]
[null,"space",1,1,1]
[null,"space",1,1,1]
[null,"space",1,1,1]
[null,"space",1,1,1]
[null,"space",1,1,1]
[null,"space",1,1,1]
[null,"space",1,1,1]
[null,"space",1,1,1]
[null,"space",1,1,1]
[null,"space",1,1,1]
[null,"space",1,1,1]
[null,"space",1,1,1]
[null,"space",1,1,1]
[null,"space",1,1,1]
[null,"space",1,1,1]
[null,"space",1,1,1]
[null,"space",1,1,1]
[null,"space",1,1,1]
[null,"space",1,1,1]
[null,"space",1,1,1]
[null,"space",1,1,1]
[null,"space",1,1,1]
[null,"space",1,1,1]
[null,"space",1,1,1]
[null,"space",1,1,1]
[null,"space",1,1,1]
[null,"space",1,1,1]
[null,"space",1,1,1]
[null,"space",1,1,1]
[null,"space",1,1,1]
[null,"space",1,1,1]
[null,"space",1,1,1]
[null,"space",1,1,1]
[null,"space",1,1,1]
[null,"space",1,1,1]
[null,"space",1,1,1]
[null,"space",1,1,1]
[null,"space",1,1,1]
[null,"space",1,1,1]
[null,"space",1,1,1]
[null,"space",1,1,1]
[null,"space",1,1,1]
[null,"space",1,1,1]
[null,"space",1,1,1]
[null,"space",1,1,1]
[null,"space",1,1,1]
[null,"space",1,1,1]
[null,"space",1,1,1]
[null,"space",1,1,1]
[null,"space",1,1,1]
[null,"space",1,1,1]
[null,"space",1,1,1]
[null,"space",1,1,1]
[null,"space",1,1,1]
[null,"space",1,1,1]
[null,{"$f":"IF((C1474 > 0),\"space\",(IF((D1474 > 0),\"num\",(IF((E1474 > 0),\"punch\",\"text\")))))","v":"space"},{"$f":"IFERROR(FIND(A1474,\" \",1),0)","v":1},{"$f":"IFERROR(FIND(A1474,\"1234567890\",1),0)","v":1},{"$f":"IFERROR(FIND(A1474,\".\",1),0)","v":1}]
[null,"space",1,1,1]
[null,"space",1,1,1]
[null,"space",1,1,1]
[null,"space",1,1,1]
[null,"space",1,1,1]
[null,"space",1,1,1]
[null,"space",1,1,1]
[null,"space",1,1,1]
[null,"space",1,1,1]
[null,"space",1,1,1]
[null,"space",1,1,1]
[null,"space",1,1,1]
[null,"space",1,1,1]
[null,"space",1,1,1]
[null,"space",1,1,1]
[null,"space",1,1,1]
[null,"space",1,1,1]
[null,"space",1,1,1]
[null,"space",1,1,1]
[null,"space",1,1,1]
[null,"space",1,1,1]
[null,"space",1,1,1]
[null,"space",1,1,1]
[null,"space",1,1,1]
[null,"space",1,1,1]
[null,"space",1,1,1]
[null,"space",1,1,1]
[null,"space",1,1,1]
[null,"space",1,1,1]
[null,"space",1,1,1]
[null,"space",1,1,1]
[null,"space",1,1,1]
[null,"space",1,1,1]
[null,"space",1,1,1]
[null,"space",1,1,1]
[null,"space",1,1,1]
[null,"space",1,1,1]
[null,"space",1,1,1]
[null,"space",1,1,1]
[null,"space",1,1,1]
[null,"space",1,1,1]
[null,"space",1,1,1]
[null,"space",1,1,1]
[null,"space",1,1,1]
[null,"space",1,1,1]
[null,"space",1,1,1]
[null,"space",1,1,1]
[null,"space",1,1,1]
[null,"space",1,1,1]
[null,"space",1,1,1]
[null,"space",1,1,1]
[null,"space",1,1,1]
[null,"space",1,1,1]
[null,"space",1,1,1]
[null,"space",1,1,1]
[null,"space",1,1,1]
[null,"space",1,1,1]
[null,"space",1,1,1]
[null,"space",1,1,1]
[null,"space",1,1,1]
[null,"space",1,1,1]
[null,"space",1,1,1]
[null,"space",1,1,1]
[null,{"$f":"IF((C1538 > 0),\"space\",(IF((D1538 > 0),\"num\",(IF((E1538 > 0),\"punch\",\"text\")))))","v":"space"},{"$f":"IFERROR(FIND(A1538,\" \",1),0)","v":1},{"$f":"IFERROR(FIND(A1538,\"1234567890\",1),0)","v":1},{"$f":"IFERROR(FIND(A1538,\".\",1),0)","v":1}]
[null,"space",1,1,1]
[null,"space",1,1,1]
[null,"space",1,1,1]
[null,"space",1,1,1]
[null,"space",1,1,1]
[null,"space",1,1,1]
[null,"space",1,1,1]
[null,"space",1,1,1]
[null,"space",1,1,1]
[null,"space",1,1,1]
[null,"space",1,1,1]
[null,"space",1,1,1]
[null,"space",1,1,1]
[null,"space",1,1,1]
[null,"space",1,1,1]
[null,"space",1,1,1]
[null,"space",1,1,1]
[null,"space",1,1,1]
[null,"space",1,1,1]
[null,"space",1,1,1]
[null,"space",1,1,1]
[null,"space",1,1,1]
[null,"space",1,1,1]
[null,"space",1,1,1]
[null,"space",1,1,1]
[null,"space",1,1,1]
[null,"space",1,1,1]
[null,"space",1,1,1]
[null,"space",1,1,1]
[null,"space",1,1,1]
[null,"space",1,1,1]
[null,"space",1,1,1]
[null,"space",1,1,1]
[null,"space",1,1,1]
[null,"space",1,1,1]
[null,"space",1,1,1]
[null,"space",1,1,1]
[null,"space",1,1,1]
[null,"space",1,1,1]
[null,"space",1,1,1]
[null,"space",1,1,1]
[null,"space",1,1,1]
[null,"space",1,1,1]
[null,"space",1,1,1]
[null,"space",1,1,1]
[null,"space",1,1,1]
[null,"space",1,1,1]
[null,"space",1,1,1]
[null,"space",1,1,1]
[null,"space",1,1,1]
[null,"space",1,1,1]
[null,"space",1,1,1]
[null,"space",1,1,1]
[null,"space",1,1,1]
[null,"space",1,1,1]
[null,"space",1,1,1]
[null,"space",1,1,1]
[null,"space",1,1,1]
[null,"space",1,1,1]
[null,"space",1,1,1]
[null,"space",1,1,1]
[null,"space",1,1,1]
[null,"space",1,1,1]
[null,{"$f":"IF((C1602 > 0),\"space\",(IF((D1602 > 0),\"num\",(IF((E1602 > 0),\"punch\",\"text\")))))","v":"space"},{"$f":"IFERROR(FIND(A1602,\" \",1),0)","v":1},{"$f":"IFERROR(FIND(A1602,\"1234567890\",1),0)","v":1},{"$f":"IFERROR(FIND(A1602,\".\",1),0)","v":1}]
[null,"space",1,1,1]
[null,"space",1,1,1]
[null,"space",1,1,1]
[null,"space",1,1,1]
[null,"space",1,1,1]
[null,"space",1,1,1]
[null,"space",1,1,1]
[null,"space",1,1,1]
[null,"space",1,1,1]
[null,"space",1,1,1]
[null,"space",1,1,1]
[null,"space",1,1,1]
[null,"space",1,1,1]
[null,"space",1,1,1]
[null,"space",1,1,1]
[null,"space",1,1,1]
[null,"space",1,1,1]
[null,"space",1,1,1]
[null,"space",1,1,1]
[null,"space",1,1,1]
[null,"space",1,1,1]
[null,"space",1,1,1]
[null,"space",1,1,1]
[null,"space",1,1,1]
[null,"space",1,1,1]
[null,"space",1,1,1]
[null,"space",1,1,1]
[null,"space",1,1,1]
[null,"space",1,1,1]
[null,"space",1,1,1]
[null,"space",1,1,1]
[null,"space",1,1,1]
[null,"space",1,1,1]
[null,"space",1,1,1]
[null,"space",1,1,1]
[null,"space",1,1,1]
[null,"space",1,1,1]
[null,"space",1,1,1]
[null,"space",1,1,1]
[null,"space",1,1,1]
[null,"space",1,1,1]
[null,"space",1,1,1]
[null,"space",1,1,1]
[null,"space",1,1,1]
[null,"space",1,1,1]
[null,"space",1,1,1]
[null,"space",1,1,1]
[null,"space",1,1,1]
[null,"space",1,1,1]
[null,"space",1,1,1]
[null,"space",1,1,1]
[null,"space",1,1,1]
[null,"space",1,1,1]
[null,"space",1,1,1]
[null,"space",1,1,1]
[null,"space",1,1,1]
[null,"space",1,1,1]
[null,"space",1,1,1]
[null,"space",1,1,1]
[null,"space",1,1,1]
[null,"space",1,1,1]
[null,"space",1,1,1]
[null,"space",1,1,1]
[null,{"$f":"IF((C1666 > 0),\"space\",(IF((D1666 > 0),\"num\",(IF((E1666 > 0),\"punch\",\"text\")))))","v":"space"},{"$f":"IFERROR(FIND(A1666,\" \",1),0)","v":1},{"$f":"IFERROR(FIND(A1666,\"1234567890\",1),0)","v":1},{"$f":"IFERROR(FIND(A1666,\".\",1),0)","v":1}]
[null,"space",1,1,1]
[null,"space",1,1,1]
[null,"space",1,1,1]
[null,"space",1,1,1]
[null,"space",1,1,1]
[null,"space",1,1,1]
[null,"space",1,1,1]
[null,"space",1,1,1]
[null,"space",1,1,1]
[null,"space",1,1,1]
[null,"space",1,1,1]
[null,"space",1,1,1]
[null,"space",1,1,1]
[null,"space",1,1,1]
[null,"space",1,1,1]
[null,"space",1,1,1]
[null,"space",1,1,1]
[null,"space",1,1,1]
[null,"space",1,1,1]
[null,"space",1,1,1]
[null,"space",1,1,1]
[null,"space",1,1,1]
[null,"space",1,1,1]
[null,"space",1,1,1]
[null,"space",1,1,1]
[null,"space",1,1,1]
[null,"space",1,1,1]
[null,"space",1,1,1]
[null,"space",1,1,1]
[null,"space",1,1,1]
[null,"space",1,1,1]
[null,"space",1,1,1]
[null,"space",1,1,1]
[null,"space",1,1,1]
[null,"space",1,1,1]
[null,"space",1,1,1]
[null,"space",1,1,1]
[null,"space",1,1,1]
[null,"space",1,1,1]
[null,"space",1,1,1]
[null,"space",1,1,1]
[null,"space",1,1,1]
[null,"space",1,1,1]
[null,"space",1,1,1]
[null,"space",1,1,1]
[null,"space",1,1,1]
[null,"space",1,1,1]
[null,"space",1,1,1]
[null,"space",1,1,1]
[null,"space",1,1,1]
[null,"space",1,1,1]
[null,"space",1,1,1]
[null,"space",1,1,1]
[null,"space",1,1,1]
[null,"space",1,1,1]
[null,"space",1,1,1]
[null,"space",1,1,1]
[null,"space",1,1,1]
[null,"space",1,1,1]
[null,"space",1,1,1]
[null,"space",1,1,1]
[null,"space",1,1,1]
[null,"space",1,1,1]
[null,{"$f":"IF((C1730 > 0),\"space\",(IF((D1730 > 0),\"num\",(IF((E1730 > 0),\"punch\",\"text\")))))","v":"space"},{"$f":"IFERROR(FIND(A1730,\" \",1),0)","v":1},{"$f":"IFERROR(FIND(A1730,\"1234567890\",1),0)","v":1},{"$f":"IFERROR(FIND(A1730,\".\",1),0)","v":1}]
[null,"space",1,1,1]
[null,"space",1,1,1]
[null,"space",1,1,1]
[null,"space",1,1,1]
[null,"space",1,1,1]
[null,"space",1,1,1]
[null,"space",1,1,1]
[null,"space",1,1,1]
[null,"space",1,1,1]
[null,"space",1,1,1]
[null,"space",1,1,1]
[null,"space",1,1,1]
[null,"space",1,1,1]
[null,"space",1,1,1]
[null,"space",1,1,1]
[null,"space",1,1,1]
[null,"space",1,1,1]
[null,"space",1,1,1]
[null,"space",1,1,1]
[null,"space",1,1,1]
[null,"space",1,1,1]
[null,"space",1,1,1]
[null,"space",1,1,1]
[null,"space",1,1,1]
[null,"space",1,1,1]
[null,"space",1,1,1]
[null,"space",1,1,1]
[null,"space",1,1,1]
[null,"space",1,1,1]
[null,"space",1,1,1]
[null,"space",1,1,1]
[null,"space",1,1,1]
[null,"space",1,1,1]
[null,"space",1,1,1]
[null,"space",1,1,1]
[null,"space",1,1,1]
[null,"space",1,1,1]
[null,"space",1,1,1]
[null,"space",1,1,1]
[null,"space",1,1,1]
[null,"space",1,1,1]
[null,"space",1,1,1]
[null,"space",1,1,1]
[null,"space",1,1,1]
[null,"space",1,1,1]
[null,"space",1,1,1]
[null,"space",1,1,1]
[null,"space",1,1,1]
[null,"space",1,1,1]
[null,"space",1,1,1]
[null,"space",1,1,1]
[null,"space",1,1,1]
[null,"space",1,1,1]
[null,"space",1,1,1]
[null,"space",1,1,1]
[null,"space",1,1,1]
[null,"space",1,1,1]
[null,"space",1,1,1]
[null,"space",1,1,1]
[null,"space",1,1,1]
[null,"space",1,1,1]
[null,"space",1,1,1]
[null,"space",1,1,1]
[null,{"$f":"IF((C1794 > 0),\"space\",(IF((D1794 > 0),\"num\",(IF((E1794 > 0),\"punch\",\"text\")))))","v":"space"},{"$f":"IFERROR(FIND(A1794,\" \",1),0)","v":1},{"$f":"IFERROR(FIND(A1794,\"1234567890\",1),0)","v":1},{"$f":"IFERROR(FIND(A1794,\".\",1),0)","v":1}]
[null,"space",1,1,1]
[null,"space",1,1,1]
[null,"space",1,1,1]
[null,"space",1,1,1]
[null,"space",1,1,1]
[null,"space",1,1,1]
[null,"space",1,1,1]
[null,"space",1,1,1]
[null,"space",1,1,1]
[null,"space",1,1,1]
[null,"space",1,1,1]
[null,"space",1,1,1]
[null,"space",1,1,1]
[null,"space",1,1,1]
[null,"space",1,1,1]
[null,"space",1,1,1]
[null,"space",1,1,1]
[null,"space",1,1,1]
[null,"space",1,1,1]
[null,"space",1,1,1]
[null,"space",1,1,1]
[null,"space",1,1,1]
[null,"space",1,1,1]
[null,"space",1,1,1]
[null,"space",1,1,1]
[null,"space",1,1,1]
[null,"space",1,1,1]
[null,"space",1,1,1]
[null,"space",1,1,1]
[null,"space",1,1,1]
[null,"space",1,1,1]
[null,"space",1,1,1]
[null,"space",1,1,1]
[null,"space",1,1,1]
[null,"space",1,1,1]
[null,"space",1,1,1]
[null,"space",1,1,1]
[null,"space",1,1,1]
[null,"space",1,1,1]
[null,"space",1,1,1]
[null,"space",1,1,1]
[null,"space",1,1,1]
[null,"space",1,1,1]
[null,"space",1,1,1]
[null,"space",1,1,1]
[null,"space",1,1,1]
[null,"space",1,1,1]
[null,"space",1,1,1]
[null,"space",1,1,1]
[null,"space",1,1,1]
[null,"space",1,1,1]
[null,"space",1,1,1]
[null,"space",1,1,1]
[null,"space",1,1,1]
[null,"space",1,1,1]
[null,"space",1,1,1]
[null,"space",1,1,1]
[null,"space",1,1,1]
[null,"space",1,1,1]
[null,"space",1,1,1]
[null,"space",1,1,1]
[null,"space",1,1,1]
[null,"space",1,1,1]
[null,{"$f":"IF((C1858 > 0),\"space\",(IF((D1858 > 0),\"num\",(IF((E1858 > 0),\"punch\",\"text\")))))","v":"space"},{"$f":"IFERROR(FIND(A1858,\" \",1),0)","v":1},{"$f":"IFERROR(FIND(A1858,\"1234567890\",1),0)","v":1},{"$f":"IFERROR(FIND(A1858,\".\",1),0)","v":1}]
[null,"space",1,1,1]
[null,"space",1,1,1]
[null,"space",1,1,1]
[null,"space",1,1,1]
[null,"space",1,1,1]
[null,"space",1,1,1]
[null,"space",1,1,1]
[null,"space",1,1,1]
[null,"space",1,1,1]
[null,"space",1,1,1]
[null,"space",1,1,1]
[null,"space",1,1,1]
[null,"space",1,1,1]
[null,"space",1,1,1]
[null,"space",1,1,1]
[null,"space",1,1,1]
[null,"space",1,1,1]
[null,"space",1,1,1]
[null,"space",1,1,1]
[null,"space",1,1,1]
[null,"space",1,1,1]
[null,"space",1,1,1]
[null,"space",1,1,1]
[null,"space",1,1,1]
[null,"space",1,1,1]
[null,"space",1,1,1]
[null,"space",1,1,1]
[null,"space",1,1,1]
[null,"space",1,1,1]
[null,"space",1,1,1]
[null,"space",1,1,1]
[null,"space",1,1,1]
[null,"space",1,1,1]
[null,"space",1,1,1]
[null,"space",1,1,1]
[null,"space",1,1,1]
[null,"space",1,1,1]
[null,"space",1,1,1]
[null,"space",1,1,1]
[null,"space",1,1,1]
[null,"space",1,1,1]
[null,"space",1,1,1]
[null,"space",1,1,1]
[null,"space",1,1,1]
[null,"space",1,1,1]
[null,"space",1,1,1]
[null,"space",1,1,1]
[null,"space",1,1,1]
[null,"space",1,1,1]
[null,"space",1,1,1]
[null,"space",1,1,1]
[null,"space",1,1,1]
[null,"space",1,1,1]
[null,"space",1,1,1]
[null,"space",1,1,1]
[null,"space",1,1,1]
[null,"space",1,1,1]
[null,"space",1,1,1]
[null,"space",1,1,1]
[null,"space",1,1,1]
[null,"space",1,1,1]
[null,"space",1,1,1]
[null,"space",1,1,1]
[null,{"$f":"IF((C1922 > 0),\"space\",(IF((D1922 > 0),\"num\",(IF((E1922 > 0),\"punch\",\"text\")))))","v":"space"},{"$f":"IFERROR(FIND(A1922,\" \",1),0)","v":1},{"$f":"IFERROR(FIND(A1922,\"1234567890\",1),0)","v":1},{"$f":"IFERROR(FIND(A1922,\".\",1),0)","v":1}]
[null,"space",1,1,1]
[null,"space",1,1,1]
[null,"space",1,1,1]
[null,"space",1,1,1]
[null,"space",1,1,1]
[null,"space",1,1,1]
[null,"space",1,1,1]
[null,"space",1,1,1]
[null,"space",1,1,1]
[null,"space",1,1,1]
[null,"space",1,1,1]
[null,"space",1,1,1]
[null,"space",1,1,1]
[null,"space",1,1,1]
[null,"space",1,1,1]
[null,"space",1,1,1]
[null,"space",1,1,1]
[null,"space",1,1,1]
[null,"space",1,1,1]
[null,"space",1,1,1]
[null,"space",1,1,1]
[null,"space",1,1,1]
[null,"space",1,1,1]
[null,"space",1,1,1]
[null,"space",1,1,1]
[null,"space",1,1,1]
[null,"space",1,1,1]
[null,"space",1,1,1]
[null,"space",1,1,1]
[null,"space",1,1,1]
[null,"space",1,1,1]
[null,"space",1,1,1]
[null,"space",1,1,1]
[null,"space",1,1,1]
[null,"space",1,1,1]
[null,"space",1,1,1]
[null,"space",1,1,1]
[null,"space",1,1,1]
[null,"space",1,1,1]
[null,"space",1,1,1]
[null,"space",1,1,1]
[null,"space",1,1,1]
[null,"space",1,1,1]
[null,"space",1,1,1]
[null,"space",1,1,1]
[null,"space",1,1,1]
[null,"space",1,1,1]
[null,"space",1,1,1]
[null,"space",1,1,1]
[null,"space",1,1,1]
[null,"space",1,1,1]
[null,"space",1,1,1]
[null,"space",1,1,1]
[null,"space",1,1,1]
[null,"space",1,1,1]
[null,"space",1,1,1]
[null,"space",1,1,1]
[null,"space",1,1,1]
[null,"space",1,1,1]
[null,"space",1,1,1]
[null,"space",1,1,1]
[null,"space",1,1,1]
[null,"space",1,1,1]
[null,{"$f":"IF((C1986 > 0),\"space\",(IF((D1986 > 0),\"num\",(IF((E1986 > 0),\"punch\",\"text\")))))","v":"space"},{"$f":"IFERROR(FIND(A1986,\" \",1),0)","v":1},{"$f":"IFERROR(FIND(A1986,\"1234567890\",1),0)","v":1},{"$f":"IFERROR(FIND(A1986,\".\",1),0)","v":1}]
[null,"space",1,1,1]
[null,"space",1,1,1]
[null,"space",1,1,1]
[null,"space",1,1,1]
[null,"space",1,1,1]
[null,"space",1,1,1]
[null,"space",1,1,1]
[null,"space",1,1,1]
[null,"space",1,1,1]
[null,"space",1,1,1]
[null,"space",1,1,1]
[null,"space",1,1,1]
[null,"space",1,1,1]
[null,"space",1,1,1]
[null,"space",1,1,1]
[null,"space",1,1,1]
[null,"space",1,1,1]
[null,"space",1,1,1]
[null,"space",1,1,1]
[null,"space",1,1,1]
[null,"space",1,1,1]
[null,"space",1,1,1]
[null,"space",1,1,1]
[null,"space",1,1,1]
[null,"space",1,1,1]
[null,"space",1,1,1]
[null,"space",1,1,1]
[null,"space",1,1,1]
[null,"space",1,1,1]
[null,"space",1,1,1]
[null,"space",1,1,1]
[null,"space",1,1,1]
[null,"space",1,1,1]
[null,"space",1,1,1]
[null,"space",1,1,1]
[null,"space",1,1,1]
[null,"space",1,1,1]
[null,"space",1,1,1]
[null,"space",1,1,1]
[null,"space",1,1,1]
[null,"space",1,1,1]
[null,"space",1,1,1]
[null,"space",1,1,1]
[null,"space",1,1,1]
[null,"space",1,1,1]
[null,"space",1,1,1]
[null,"space",1,1,1]
[null,"space",1,1,1]
[null,"space",1,1,1]
[null,"space",1,1,1]
[null,"space",1,1,1]
[null,"space",1,1,1]
[null,"space",1,1,1]
[null,"space",1,1,1]
[null,"space",1,1,1]
[null,"space",1,1,1]
[null,"space",1,1,1]
[null,"space",1,1,1]
[null,"space",1,1,1]
[null,"space",1,1,1]
[null,"space",1,1,1]
[null,"space",1,1,1]
[null,"space",1,1,1]
[null,{"$f":"IF((C2050 > 0),\"space\",(IF((D2050 > 0),\"num\",(IF((E2050 > 0),\"punch\",\"text\")))))","v":"space"},{"$f":"IFERROR(FIND(A2050,\" \",1),0)","v":1},{"$f":"IFERROR(FIND(A2050,\"1234567890\",1),0)","v":1},{"$f":"IFERROR(FIND(A2050,\".\",1),0)","v":1}]
[null,"space",1,1,1]
[null,"space",1,1,1]
[null,"space",1,1,1]
[null,"space",1,1,1]
[null,"space",1,1,1]
[null,"space",1,1,1]
[null,"space",1,1,1]
[null,"space",1,1,1]
[null,"space",1,1,1]
[null,"space",1,1,1]
[null,"space",1,1,1]
[null,"space",1,1,1]
[null,"space",1,1,1]
[null,"space",1,1,1]
[null,"space",1,1,1]
[null,"space",1,1,1]
[null,"space",1,1,1]
[null,"space",1,1,1]
[null,"space",1,1,1]
[null,"space",1,1,1]
[null,"space",1,1,1]
[null,"space",1,1,1]
[null,"space",1,1,1]
[null,"space",1,1,1]
[null,"space",1,1,1]
[null,"space",1,1,1]
[null,"space",1,1,1]
[null,"space",1,1,1]
[null,"space",1,1,1]
[null,"space",1,1,1]
[null,"space",1,1,1]
[null,"space",1,1,1]
[null,"space",1,1,1]
[null,"space",1,1,1]
[null,"space",1,1,1]
[null,"space",1,1,1]
[null,"space",1,1,1]
[null,"space",1,1,1]
[null,"space",1,1,1]
[null,"space",1,1,1]
[null,"space",1,1,1]
[null,"space",1,1,1]
[null,"space",1,1,1]
[null,"space",1,1,1]
[null,"space",1,1,1]
[null,"space",1,1,1]
[null,"space",1,1,1]
[null,"space",1,1,1]
[null,"space",1,1,1]
[null,"space",1,1,1]
[null,"space",1,1,1]
[null,"space",1,1,1]
[null,"space",1,1,1]
[null,"space",1,1,1]
[null,"space",1,1,1]
[null,"space",1,1,1]
[null,"space",1,1,1]
[null,"space",1,1,1]
[null,"space",1,1,1]
[null,"space",1,1,1]
[null,"space",1,1,1]
[null,"space",1,1,1]
[null,"space",1,1,1]
[null,{"$f":"IF((C2114 > 0),\"space\",(IF((D2114 > 0),\"num\",(IF((E2114 > 0),\"punch\",\"text\")))))","v":"space"},{"$f":"IFERROR(FIND(A2114,\" \",1),0)","v":1},{"$f":"IFERROR(FIND(A2114,\"1234567890\",1),0)","v":1},{"$f":"IFERROR(FIND(A2114,\".\",1),0)","v":1}]
[null,"space",1,1,1]
[null,"space",1,1,1]
[null,"space",1,1,1]
[null,"space",1,1,1]
[null,"space",1,1,1]
[null,"space",1,1,1]
[null,"space",1,1,1]
[null,"space",1,1,1]
[null,"space",1,1,1]
[null,"space",1,1,1]
[null,"space",1,1,1]
[null,"space",1,1,1]
[null,"space",1,1,1]
[null,"space",1,1,1]
[null,"space",1,1,1]
[null,"space",1,1,1]
[null,"space",1,1,1]
[null,"space",1,1,1]
[null,"space",1,1,1]
[null,"space",1,1,1]
[null,"space",1,1,1]
[null,"space",1,1,1]
[null,"space",1,1,1]
[null,"space",1,1,1]
[null,"space",1,1,1]
[null,"space",1,1,1]
[null,"space",1,1,1]
[null,"space",1,1,1]
[null,"space",1,1,1]
[null,"space",1,1,1]
[null,"space",1,1,1]
[null,"space",1,1,1]
[null,"space",1,1,1]
[null,"space",1,1,1]
[null,"space",1,1,1]
[null,"space",1,1,1]
[null,"space",1,1,1]
[null,"space",1,1,1]
[null,"space",1,1,1]
[null,"space",1,1,1]
[null,"space",1,1,1]
[null,"space",1,1,1]
[null,"space",1,1,1]
[null,"space",1,1,1]
[null,"space",1,1,1]
[null,"space",1,1,1]
[null,"space",1,1,1]
[null,"space",1,1,1]
[null,"space",1,1,1]
[null,"space",1,1,1]
[null,"space",1,1,1]
[null,"space",1,1,1]
[null,"space",1,1,1]
[null,"space",1,1,1]
[null,"space",1,1,1]
[null,"space",1,1,1]
[null,"space",1,1,1]
[null,"space",1,1,1]
[null,"space",1,1,1]
[null,"space",1,1,1]
[null,"space",1,1,1]
[null,"space",1,1,1]
[null,"space",1,1,1]
[null,{"$f":"IF((C2178 > 0),\"space\",(IF((D2178 > 0),\"num\",(IF((E2178 > 0),\"punch\",\"text\")))))","v":"space"},{"$f":"IFERROR(FIND(A2178,\" \",1),0)","v":1},{"$f":"IFERROR(FIND(A2178,\"1234567890\",1),0)","v":1},{"$f":"IFERROR(FIND(A2178,\".\",1),0)","v":1}]
[null,"space",1,1,1]
[null,"space",1,1,1]
[null,"space",1,1,1]
[null,"space",1,1,1]
[null,"space",1,1,1]
[null,"space",1,1,1]
[null,"space",1,1,1]
[null,"space",1,1,1]
[null,"space",1,1,1]
[null,"space",1,1,1]
[null,"space",1,1,1]
[null,"space",1,1,1]
[null,"space",1,1,1]
[null,"space",1,1,1]
[null,"space",1,1,1]
[null,"space",1,1,1]
[null,"space",1,1,1]
[null,"space",1,1,1]
[null,"space",1,1,1]
[null,"space",1,1,1]
[null,"space",1,1,1]
[null,"space",1,1,1]
[null,"space",1,1,1]
[null,"space",1,1,1]
[null,"space",1,1,1]
[null,"space",1,1,1]
[null,"space",1,1,1]
[null,"space",1,1,1]
[null,"space",1,1,1]
[null,"space",1,1,1]
[null,"space",1,1,1]
[null,"space",1,1,1]
[null,"space",1,1,1]
[null,"space",1,1,1]
[null,"space",1,1,1]
[null,"space",1,1,1]
[null,"space",1,1,1]
[null,"space",1,1,1]
[null,"space",1,1,1]
[null,"space",1,1,1]
[null,"space",1,1,1]
[null,"space",1,1,1]
[null,"space",1,1,1]
[null,"space",1,1,1]
[null,"space",1,1,1]
[null,"space",1,1,1]
[null,"space",1,1,1]
[null,"space",1,1,1]
[null,"space",1,1,1]
[null,"space",1,1,1]
[null,"space",1,1,1]
[null,"space",1,1,1]
[null,"space",1,1,1]
[null,"space",1,1,1]
[null,"space",1,1,1]
[null,"space",1,1,1]
[null,"space",1,1,1]
[null,"space",1,1,1]
[null,"space",1,1,1]
[null,"space",1,1,1]
[null,"space",1,1,1]
[null,"space",1,1,1]
[null,"space",1,1,1]
[null,{"$f":"IF((C2242 > 0),\"space\",(IF((D2242 > 0),\"num\",(IF((E2242 > 0),\"punch\",\"text\")))))","v":"space"},{"$f":"IFERROR(FIND(A2242,\" \",1),0)","v":1},{"$f":"IFERROR(FIND(A2242,\"1234567890\",1),0)","v":1},{"$f":"IFERROR(FIND(A2242,\".\",1),0)","v":1}]
[null,"space",1,1,1]
[null,"space",1,1,1]
[null,"space",1,1,1]
[null,"space",1,1,1]
[null,"space",1,1,1]
[null,"space",1,1,1]
[null,"space",1,1,1]
[null,"space",1,1,1]
[null,"space",1,1,1]
[null,"space",1,1,1]
[null,"space",1,1,1]
[null,"space",1,1,1]
[null,"space",1,1,1]
[null,"space",1,1,1]
[null,"space",1,1,1]
[null,"space",1,1,1]
[null,"space",1,1,1]
[null,"space",1,1,1]
[null,"space",1,1,1]
[null,"space",1,1,1]
[null,"space",1,1,1]
[null,"space",1,1,1]
[null,"space",1,1,1]
[null,"space",1,1,1]
[null,"space",1,1,1]
[null,"space",1,1,1]
[null,"space",1,1,1]
[null,"space",1,1,1]
[null,"space",1,1,1]
[null,"space",1,1,1]
[null,"space",1,1,1]
[null,"space",1,1,1]
[null,"space",1,1,1]
[null,"space",1,1,1]
[null,"space",1,1,1]
[null,"space",1,1,1]
[null,"space",1,1,1]
[null,"space",1,1,1]
[null,"space",1,1,1]
[null,"space",1,1,1]
[null,"space",1,1,1]
[null,"space",1,1,1]
[null,"space",1,1,1]
[null,"space",1,1,1]
[null,"space",1,1,1]
[null,"space",1,1,1]
[null,"space",1,1,1]
[null,"space",1,1,1]
[null,"space",1,1,1]
[null,"space",1,1,1]
[null,"space",1,1,1]
[null,"space",1,1,1]
[null,"space",1,1,1]
[null,"space",1,1,1]
[null,"space",1,1,1]
[null,"space",1,1,1]
[null,"space",1,1,1]
[null,"space",1,1,1]
[null,"space",1,1,1]
[null,"space",1,1,1]
[null,"space",1,1,1]
[null,"space",1,1,1]
[null,"space",1,1,1]
[null,{"$f":"IF((C2306 > 0),\"space\",(IF((D2306 > 0),\"num\",(IF((E2306 > 0),\"punch\",\"text\")))))","v":"space"},{"$f":"IFERROR(FIND(A2306,\" \",1),0)","v":1},{"$f":"IFERROR(FIND(A2306,\"1234567890\",1),0)","v":1},{"$f":"IFERROR(FIND(A2306,\".\",1),0)","v":1}]
[null,"space",1,1,1]
[null,"space",1,1,1]
[null,"space",1,1,1]
[null,"space",1,1,1]
[null,"space",1,1,1]
[null,"space",1,1,1]
[null,"space",1,1,1]
[null,"space",1,1,1]
[null,"space",1,1,1]
[null,"space",1,1,1]
[null,"space",1,1,1]
[null,"space",1,1,1]
[null,"space",1,1,1]
[null,"space",1,1,1]
[null,"space",1,1,1]
[null,"space",1,1,1]
[null,"space",1,1,1]
[null,"space",1,1,1]
[null,"space",1,1,1]
[null,"space",1,1,1]
[null,"space",1,1,1]
[null,"space",1,1,1]
[null,"space",1,1,1]
[null,"space",1,1,1]
[null,"space",1,1,1]
[null,"space",1,1,1]
[null,"space",1,1,1]
[null,"space",1,1,1]
[null,"space",1,1,1]
[null,"space",1,1,1]
[null,"space",1,1,1]
[null,"space",1,1,1]
[null,"space",1,1,1]
[null,"space",1,1,1]
[null,"space",1,1,1]
[null,"space",1,1,1]
[null,"space",1,1,1]
[null,"space",1,1,1]
[null,"space",1,1,1]
[null,"space",1,1,1]
[null,"space",1,1,1]
[null,"space",1,1,1]
[null,"space",1,1,1]
[null,"space",1,1,1]
[null,"space",1,1,1]
[null,"space",1,1,1]
[null,"space",1,1,1]
[null,"space",1,1,1]
[null,"space",1,1,1]
[null,"space",1,1,1]
[null,"space",1,1,1]
[null,"space",1,1,1]
[null,"space",1,1,1]
[null,"space",1,1,1]
[null,"space",1,1,1]
[null,"space",1,1,1]
[null,"space",1,1,1]
[null,"space",1,1,1]
[null,"space",1,1,1]
[null,"space",1,1,1]
[null,"space",1,1,1]
[null,"space",1,1,1]
[null,"space",1,1,1]
[null,{"$f":"IF((C2370 > 0),\"space\",(IF((D2370 > 0),\"num\",(IF((E2370 > 0),\"punch\",\"text\")))))","v":"space"},{"$f":"IFERROR(FIND(A2370,\" \",1),0)","v":1},{"$f":"IFERROR(FIND(A2370,\"1234567890\",1),0)","v":1},{"$f":"IFERROR(FIND(A2370,\".\",1),0)","v":1}]
[null,"space",1,1,1]
[null,"space",1,1,1]
[null,"space",1,1,1]
[null,"space",1,1,1]
[null,"space",1,1,1]
[null,"space",1,1,1]
[null,"space",1,1,1]
[null,"space",1,1,1]
[null,"space",1,1,1]
[null,"space",1,1,1]
[null,"space",1,1,1]
[null,"space",1,1,1]
[null,"space",1,1,1]
[null,"space",1,1,1]
[null,"space",1,1,1]
[null,"space",1,1,1]
[null,"space",1,1,1]
[null,"space",1,1,1]
[null,"space",1,1,1]
[null,"space",1,1,1]
[null,"space",1,1,1]
[null,"space",1,1,1]
[null,"space",1,1,1]
[null,"space",1,1,1]
[null,"space",1,1,1]
[null,"space",1,1,1]
[null,"space",1,1,1]
[null,"space",1,1,1]
[null,"space",1,1,1]
[null,"space",1,1,1]
[null,"space",1,1,1]
[null,"space",1,1,1]
[null,"space",1,1,1]
[null,"space",1,1,1]
[null,"space",1,1,1]
[null,"space",1,1,1]
[null,"space",1,1,1]
[null,"space",1,1,1]
[null,"space",1,1,1]
[null,"space",1,1,1]
[null,"space",1,1,1]
[null,"space",1,1,1]
[null,"space",1,1,1]
[null,"space",1,1,1]
[null,"space",1,1,1]
[null,"space",1,1,1]
[null,"space",1,1,1]
[null,"space",1,1,1]
[null,"space",1,1,1]
[null,"space",1,1,1]
[null,"space",1,1,1]
[null,"space",1,1,1]
[null,"space",1,1,1]
[null,"space",1,1,1]
[null,"space",1,1,1]
[null,"space",1,1,1]
[null,"space",1,1,1]
[null,"space",1,1,1]
[null,"space",1,1,1]
[null,"space",1,1,1]
[null,"space",1,1,1]
[null,"space",1,1,1]
[null,"space",1,1,1]
[null,{"$f":"IF((C2434 > 0),\"space\",(IF((D2434 > 0),\"num\",(IF((E2434 > 0),\"punch\",\"text\")))))","v":"space"},{"$f":"IFERROR(FIND(A2434,\" \",1),0)","v":1},{"$f":"IFERROR(FIND(A2434,\"1234567890\",1),0)","v":1},{"$f":"IFERROR(FIND(A2434,\".\",1),0)","v":1}]
[null,"space",1,1,1]
[null,"space",1,1,1]
[null,"space",1,1,1]
[null,"space",1,1,1]
[null,"space",1,1,1]
[null,"space",1,1,1]
[null,"space",1,1,1]
[null,"space",1,1,1]
[null,"space",1,1,1]
[null,"space",1,1,1]
[null,"space",1,1,1]
[null,"space",1,1,1]
[null,"space",1,1,1]
[null,"space",1,1,1]
[null,"space",1,1,1]
[null,"space",1,1,1]
[null,"space",1,1,1]
[null,"space",1,1,1]
[null,"space",1,1,1]
[null,"space",1,1,1]
[null,"space",1,1,1]
[null,"space",1,1,1]
[null,"space",1,1,1]
[null,"space",1,1,1]
[null,"space",1,1,1]
[null,"space",1,1,1]
[null,"space",1,1,1]
[null,"space",1,1,1]
[null,"space",1,1,1]
[null,"space",1,1,1]
[null,"space",1,1,1]
[null,"space",1,1,1]
[null,"space",1,1,1]
[null,"space",1,1,1]
[null,"space",1,1,1]
[null,"space",1,1,1]
[null,"space",1,1,1]
[null,"space",1,1,1]
[null,"space",1,1,1]
[null,"space",1,1,1]
[null,"space",1,1,1]
[null,"space",1,1,1]
[null,"space",1,1,1]
[null,"space",1,1,1]
[null,"space",1,1,1]
[null,"space",1,1,1]
[null,"space",1,1,1]
[null,"space",1,1,1]
[null,"space",1,1,1]
[null,"space",1,1,1]
[null,"space",1,1,1]
[null,"space",1,1,1]
[null,"space",1,1,1]
[null,"space",1,1,1]
[null,"space",1,1,1]
[null,"space",1,1,1]
[null,"space",1,1,1]
[null,"space",1,1,1]
[null,"space",1,1,1]
[null,"space",1,1,1]
[null,"space",1,1,1]
[null,"space",1,1,1]
[null,"space",1,1,1]
[null,{"$f":"IF((C2498 > 0),\"space\",(IF((D2498 > 0),\"num\",(IF((E2498 > 0),\"punch\",\"text\")))))","v":"space"},{"$f":"IFERROR(FIND(A2498,\" \",1),0)","v":1},{"$f":"IFERROR(FIND(A2498,\"1234567890\",1),0)","v":1},{"$f":"IFERROR(FIND(A2498,\".\",1),0)","v":1}]
[null,"space",1,1,1]
[null,"space",1,1,1]
[null,"space",1,1,1]
[null,"space",1,1,1]
[null,"space",1,1,1]
[null,"space",1,1,1]
[null,"space",1,1,1]
[null,"space",1,1,1]
[null,"space",1,1,1]
[null,"space",1,1,1]
[null,"space",1,1,1]
[null,"space",1,1,1]
[null,"space",1,1,1]
[null,"space",1,1,1]
[null,"space",1,1,1]
[null,"space",1,1,1]
[null,"space",1,1,1]
[null,"space",1,1,1]
[null,"space",1,1,1]
[null,"space",1,1,1]
[null,"space",1,1,1]
[null,"space",1,1,1]
[null,"space",1,1,1]
[null,"space",1,1,1]
[null,"space",1,1,1]
[null,"space",1,1,1]
[null,"space",1,1,1]
[null,"space",1,1,1]
[null,"space",1,1,1]
[null,"space",1,1,1]
[null,"space",1,1,1]
[null,"space",1,1,1]
[null,"space",1,1,1]
[null,"space",1,1,1]
[null,"space",1,1,1]
[null,"space",1,1,1]
[null,"space",1,1,1]
[null,"space",1,1,1]
[null,"space",1,1,1]
[null,"space",1,1,1]
[null,"space",1,1,1]
[null,"space",1,1,1]
[null,"space",1,1,1]
[null,"space",1,1,1]
[null,"space",1,1,1]
[null,"space",1,1,1]
[null,"space",1,1,1]
[null,"space",1,1,1]
[null,"space",1,1,1]
[null,"space",1,1,1]
[null,"space",1,1,1]
[null,"space",1,1,1]
[null,"space",1,1,1]
[null,"space",1,1,1]
[null,"space",1,1,1]
[null,"space",1,1,1]
[null,"space",1,1,1]
[null,"space",1,1,1]
[null,"space",1,1,1]
[null,"space",1,1,1]
[null,"space",1,1,1]
[null,"space",1,1,1]
[null,"space",1,1,1]
[null,{"$f":"IF((C2562 > 0),\"space\",(IF((D2562 > 0),\"num\",(IF((E2562 > 0),\"punch\",\"text\")))))","v":"space"},{"$f":"IFERROR(FIND(A2562,\" \",1),0)","v":1},{"$f":"IFERROR(FIND(A2562,\"1234567890\",1),0)","v":1},{"$f":"IFERROR(FIND(A2562,\".\",1),0)","v":1}]
[null,"space",1,1,1]
[null,"space",1,1,1]
[null,"space",1,1,1]
[null,"space",1,1,1]
[null,"space",1,1,1]
[null,"space",1,1,1]
[null,"space",1,1,1]
[null,"space",1,1,1]
[null,"space",1,1,1]
[null,"space",1,1,1]
[null,"space",1,1,1]
[null,"space",1,1,1]
[null,"space",1,1,1]
[null,"space",1,1,1]
[null,"space",1,1,1]
[null,"space",1,1,1]
[null,"space",1,1,1]
[null,"space",1,1,1]
[null,"space",1,1,1]
[null,"space",1,1,1]
[null,"space",1,1,1]
[null,"space",1,1,1]
[null,"space",1,1,1]
[null,"space",1,1,1]
[null,"space",1,1,1]
[null,"space",1,1,1]
[null,"space",1,1,1]
[null,"space",1,1,1]
[null,"space",1,1,1]
[null,"space",1,1,1]
[null,"space",1,1,1]
[null,"space",1,1,1]
[null,"space",1,1,1]
[null,"space",1,1,1]
[null,"space",1,1,1]
[null,"space",1,1,1]
[null,"space",1,1,1]
[null,"space",1,1,1]
[null,"space",1,1,1]
[null,"space",1,1,1]
[null,"space",1,1,1]
[null,"space",1,1,1]
[null,"space",1,1,1]
[null,"space",1,1,1]
[null,"space",1,1,1]
[null,"space",1,1,1]
[null,"space",1,1,1]
[null,"space",1,1,1]
[null,"space",1,1,1]
[null,"space",1,1,1]
[null,"space",1,1,1]
[null,"space",1,1,1]
[null,"space",1,1,1]
[null,"space",1,1,1]
[null,"space",1,1,1]
[null,"space",1,1,1]
[null,"space",1,1,1]
[null,"space",1,1,1]
[null,"space",1,1,1]
[null,"space",1,1,1]
[null,"space",1,1,1]
[null,"space",1,1,1]
[null,"space",1,1,1]
[null,{"$f":"IF((C2626 > 0),\"space\",(IF((D2626 > 0),\"num\",(IF((E2626 > 0),\"punch\",\"text\")))))","v":"space"},{"$f":"IFERROR(FIND(A2626,\" \",1),0)","v":1},{"$f":"IFERROR(FIND(A2626,\"1234567890\",1),0)","v":1},{"$f":"IFERROR(FIND(A2626,\".\",1),0)","v":1}]
[null,"space",1,1,1]
[null,"space",1,1,1]
[null,"space",1,1,1]
[null,"space",1,1,1]
[null,"space",1,1,1]
[null,"space",1,1,1]
[null,"space",1,1,1]
[null,"space",1,1,1]
[null,"space",1,1,1]
[null,"space",1,1,1]
[null,"space",1,1,1]
[null,"space",1,1,1]
[null,"space",1,1,1]
[null,"space",1,1,1]
[null,"space",1,1,1]
[null,"space",1,1,1]
[null,"space",1,1,1]
[null,"space",1,1,1]
[null,"space",1,1,1]
[null,"space",1,1,1]
[null,"space",1,1,1]
[null,"space",1,1,1]
[null,"space",1,1,1]
[null,"space",1,1,1]
[null,"space",1,1,1]
[null,"space",1,1,1]
[null,"space",1,1,1]
[null,"space",1,1,1]
[null,"space",1,1,1]
[null,"space",1,1,1]
[null,"space",1,1,1]
[null,"space",1,1,1]
[null,"space",1,1,1]
[null,"space",1,1,1]
[null,"space",1,1,1]
[null,"space",1,1,1]
[null,"space",1,1,1]
[null,"space",1,1,1]
[null,"space",1,1,1]
[null,"space",1,1,1]
[null,"space",1,1,1]
[null,"space",1,1,1]
[null,"space",1,1,1]
[null,"space",1,1,1]
[null,"space",1,1,1]
[null,"space",1,1,1]
[null,"space",1,1,1]
[null,"space",1,1,1]
[null,"space",1,1,1]
[null,"space",1,1,1]
[null,"space",1,1,1]
[null,"space",1,1,1]
[null,"space",1,1,1]
[null,"space",1,1,1]
[null,"space",1,1,1]
[null,"space",1,1,1]
[null,"space",1,1,1]
[null,"space",1,1,1]
[null,"space",1,1,1]
[null,"space",1,1,1]
[null,"space",1,1,1]
[null,"space",1,1,1]
[null,"space",1,1,1]
[null,{"$f":"IF((C2690 > 0),\"space\",(IF((D2690 > 0),\"num\",(IF((E2690 > 0),\"punch\",\"text\")))))","v":"space"},{"$f":"IFERROR(FIND(A2690,\" \",1),0)","v":1},{"$f":"IFERROR(FIND(A2690,\"1234567890\",1),0)","v":1},{"$f":"IFERROR(FIND(A2690,\".\",1),0)","v":1}]
[null,"space",1,1,1]
[null,"space",1,1,1]
[null,"space",1,1,1]
[null,"space",1,1,1]
[null,"space",1,1,1]
[null,"space",1,1,1]
[null,"space",1,1,1]
[null,"space",1,1,1]
[null,"space",1,1,1]
[null,"space",1,1,1]
[null,"space",1,1,1]
[null,"space",1,1,1]
[null,"space",1,1,1]
[null,"space",1,1,1]
[null,"space",1,1,1]
[null,"space",1,1,1]
[null,"space",1,1,1]
[null,"space",1,1,1]
[null,"space",1,1,1]
[null,"space",1,1,1]
[null,"space",1,1,1]
[null,"space",1,1,1]
[null,"space",1,1,1]
[null,"space",1,1,1]
[null,"space",1,1,1]
[null,"space",1,1,1]
[null,"space",1,1,1]
[null,"space",1,1,1]
[null,"space",1,1,1]
[null,"space",1,1,1]
[null,"space",1,1,1]
[null,"space",1,1,1]
[null,"space",1,1,1]
[null,"space",1,1,1]
[null,"space",1,1,1]
[null,"space",1,1,1]
[null,"space",1,1,1]
[null,"space",1,1,1]
[null,"space",1,1,1]
[null,"space",1,1,1]
[null,"space",1,1,1]
[null,"space",1,1,1]
[null,"space",1,1,1]
[null,"space",1,1,1]
[null,"space",1,1,1]
[null,"space",1,1,1]
[null,"space",1,1,1]
[null,"space",1,1,1]
[null,"space",1,1,1]
[null,"space",1,1,1]
[null,"space",1,1,1]
[null,"space",1,1,1]
[null,"space",1,1,1]
[null,"space",1,1,1]
[null,"space",1,1,1]
[null,"space",1,1,1]
[null,"space",1,1,1]
[null,"space",1,1,1]
[null,"space",1,1,1]
[null,"space",1,1,1]
[null,"space",1,1,1]
[null,"space",1,1,1]
[null,"space",1,1,1]
[null,{"$f":"IF((C2754 > 0),\"space\",(IF((D2754 > 0),\"num\",(IF((E2754 > 0),\"punch\",\"text\")))))","v":"space"},{"$f":"IFERROR(FIND(A2754,\" \",1),0)","v":1},{"$f":"IFERROR(FIND(A2754,\"1234567890\",1),0)","v":1},{"$f":"IFERROR(FIND(A2754,\".\",1),0)","v":1}]
[null,"space",1,1,1]
[null,"space",1,1,1]
[null,"space",1,1,1]
[null,"space",1,1,1]
[null,"space",1,1,1]
[null,"space",1,1,1]
[null,"space",1,1,1]
[null,"space",1,1,1]
[null,"space",1,1,1]
[null,"space",1,1,1]
[null,"space",1,1,1]
[null,"space",1,1,1]
[null,"space",1,1,1]
[null,"space",1,1,1]
[null,"space",1,1,1]
[null,"space",1,1,1]
[null,"space",1,1,1]
[null,"space",1,1,1]
[null,"space",1,1,1]
[null,"space",1,1,1]
[null,"space",1,1,1]
[null,"space",1,1,1]
[null,"space",1,1,1]
[null,"space",1,1,1]
[null,"space",1,1,1]
[null,"space",1,1,1]
[null,"space",1,1,1]
[null,"space",1,1,1]
[null,"space",1,1,1]
[null,"space",1,1,1]
[null,"space",1,1,1]
[null,"space",1,1,1]
[null,"space",1,1,1]
[null,"space",1,1,1]
[null,"space",1,1,1]
[null,"space",1,1,1]
[null,"space",1,1,1]
[null,"space",1,1,1]
[null,"space",1,1,1]
[null,"space",1,1,1]
[null,"space",1,1,1]
[null,"space",1,1,1]
[null,"space",1,1,1]
[null,"space",1,1,1]
[null,"space",1,1,1]
[null,"space",1,1,1]
[null,"space",1,1,1]
[null,"space",1,1,1]
[null,"space",1,1,1]
[null,"space",1,1,1]
[null,"space",1,1,1]
[null,"space",1,1,1]
[null,"space",1,1,1]
[null,"space",1,1,1]
[null,"space",1,1,1]
[null,"space",1,1,1]
[null,"space",1,1,1]
[null,"space",1,1,1]
[null,"space",1,1,1]
[null,"space",1,1,1]
[null,"space",1,1,1]
[null,"space",1,1,1]
[null,"space",1,1,1]
[null,{"$f":"IF((C2818 > 0),\"space\",(IF((D2818 > 0),\"num\",(IF((E2818 > 0),\"punch\",\"text\")))))","v":"space"},{"$f":"IFERROR(FIND(A2818,\" \",1),0)","v":1},{"$f":"IFERROR(FIND(A2818,\"1234567890\",1),0)","v":1},{"$f":"IFERROR(FIND(A2818,\".\",1),0)","v":1}]
[null,"space",1,1,1]
[null,"space",1,1,1]
[null,"space",1,1,1]
[null,"space",1,1,1]
[null,"space",1,1,1]
[null,"space",1,1,1]
[null,"space",1,1,1]
[null,"space",1,1,1]
[null,"space",1,1,1]
[null,"space",1,1,1]
[null,"space",1,1,1]
[null,"space",1,1,1]
[null,"space",1,1,1]
[null,"space",1,1,1]
[null,"space",1,1,1]
[null,"space",1,1,1]
[null,"space",1,1,1]
[null,"space",1,1,1]
[null,"space",1,1,1]
[null,"space",1,1,1]
[null,"space",1,1,1]
[null,"space",1,1,1]
[null,"space",1,1,1]
[null,"space",1,1,1]
[null,"space",1,1,1]
[null,"space",1,1,1]
[null,"space",1,1,1]
[null,"space",1,1,1]
[null,"space",1,1,1]
[null,"space",1,1,1]
[null,"space",1,1,1]
[null,"space",1,1,1]
[null,"space",1,1,1]
[null,"space",1,1,1]
[null,"space",1,1,1]
[null,"space",1,1,1]
[null,"space",1,1,1]
[null,"space",1,1,1]
[null,"space",1,1,1]
[null,"space",1,1,1]
[null,"space",1,1,1]
[null,"space",1,1,1]
[null,"space",1,1,1]
[null,"space",1,1,1]
[null,"space",1,1,1]
[null,"space",1,1,1]
[null,"space",1,1,1]
[null,"space",1,1,1]
[null,"space",1,1,1]
[null,"space",1,1,1]
[null,"space",1,1,1]
[null,"space",1,1,1]
[null,"space",1,1,1]
[null,"space",1,1,1]
[null,"space",1,1,1]
[null,"space",1,1,1]
[null,"space",1,1,1]
[null,"space",1,1,1]
[null,"space",1,1,1]
[null,"space",1,1,1]
[null,"space",1,1,1]
[null,"space",1,1,1]
[null,"space",1,1,1]
[null,{"$f":"IF((C2882 > 0),\"space\",(IF((D2882 > 0),\"num\",(IF((E2882 > 0),\"punch\",\"text\")))))","v":"space"},{"$f":"IFERROR(FIND(A2882,\" \",1),0)","v":1},{"$f":"IFERROR(FIND(A2882,\"1234567890\",1),0)","v":1},{"$f":"IFERROR(FIND(A2882,\".\",1),0)","v":1}]
[null,"space",1,1,1]
[null,"space",1,1,1]
[null,"space",1,1,1]
[null,"space",1,1,1]
[null,"space",1,1,1]
[null,"space",1,1,1]
[null,"space",1,1,1]
[null,"space",1,1,1]
[null,"space",1,1,1]
[null,"space",1,1,1]
[null,"space",1,1,1]
[null,"space",1,1,1]
[null,"space",1,1,1]
[null,"space",1,1,1]
[null,"space",1,1,1]
[null,"space",1,1,1]
[null,"space",1,1,1]
[null,"space",1,1,1]
[null,"space",1,1,1]
[null,"space",1,1,1]
[null,"space",1,1,1]
[null,"space",1,1,1]
[null,"space",1,1,1]
[null,"space",1,1,1]
[null,"space",1,1,1]
[null,"space",1,1,1]
[null,"space",1,1,1]
[null,"space",1,1,1]
[null,"space",1,1,1]
[null,"space",1,1,1]
[null,"space",1,1,1]
[null,"space",1,1,1]
[null,"space",1,1,1]
[null,"space",1,1,1]
[null,"space",1,1,1]
[null,"space",1,1,1]
[null,"space",1,1,1]
[null,"space",1,1,1]
[null,"space",1,1,1]
[null,"space",1,1,1]
[null,"space",1,1,1]
[null,"space",1,1,1]
[null,"space",1,1,1]
[null,"space",1,1,1]
[null,"space",1,1,1]
[null,"space",1,1,1]
[null,"space",1,1,1]
[null,"space",1,1,1]
[null,"space",1,1,1]
[null,"space",1,1,1]
[null,"space",1,1,1]
[null,"space",1,1,1]
[null,"space",1,1,1]
[null,"space",1,1,1]
[null,"space",1,1,1]
[null,"space",1,1,1]
[null,"space",1,1,1]
[null,"space",1,1,1]
[null,"space",1,1,1]
[null,"space",1,1,1]
[null,"space",1,1,1]
[null,"space",1,1,1]
[null,"space",1,1,1]
[null,{"$f":"IF((C2946 > 0),\"space\",(IF((D2946 > 0),\"num\",(IF((E2946 > 0),\"punch\",\"text\")))))","v":"space"},{"$f":"IFERROR(FIND(A2946,\" \",1),0)","v":1},{"$f":"IFERROR(FIND(A2946,\"1234567890\",1),0)","v":1},{"$f":"IFERROR(FIND(A2946,\".\",1),0)","v":1}]
[null,"space",1,1,1]
[null,"space",1,1,1]
[null,"space",1,1,1]
[null,"space",1,1,1]
[null,"space",1,1,1]
[null,"space",1,1,1]
[null,"space",1,1,1]
[null,"space",1,1,1]
[null,"space",1,1,1]
[null,"space",1,1,1]
[null,"space",1,1,1]
[null,"space",1,1,1]
[null,"space",1,1,1]
[null,"space",1,1,1]
[null,"space",1,1,1]
[null,"space",1,1,1]
[null,"space",1,1,1]
[null,"space",1,1,1]
[null,"space",1,1,1]
[null,"space",1,1,1]
[null,"space",1,1,1]
[null,"space",1,1,1]
[null,"space",1,1,1]
[null,"space",1,1,1]
[null,"space",1,1,1]
[null,"space",1,1,1]
[null,"space",1,1,1]
[null,"space",1,1,1]
[null,"space",1,1,1]
[null,"space",1,1,1]
[null,"space",1,1,1]
[null,"space",1,1,1]
[null,"space",1,1,1]
[null,"space",1,1,1]
[null,"space",1,1,1]
[null,"space",1,1,1]
[null,"space",1,1,1]
[null,"space",1,1,1]
[null,"space",1,1,1]
[null,"space",1,1,1]
[null,"space",1,1,1]
[null,"space",1,1,1]
[null,"space",1,1,1]
[null,"space",1,1,1]
[null,"space",1,1,1]
[null,"space",1,1,1]
[null,"space",1,1,1]
[null,"space",1,1,1]
[null,"space",1,1,1]
[null,"space",1,1,1]
[null,"space",1,1,1]
[null,"space",1,1,1]
[null,"space",1,1,1]
[null,"space",1,1,1]
[null,"space",1,1,1]
[null,"space",1,1,1]
[null,"space",1,1,1]
[null,"space",1,1,1]
[null,"space",1,1,1]
[null,"space",1,1,1]
[null,"space",1,1,1]
[null,"space",1,1,1]
[null,"space",1,1,1]
[null,{"$f":"IF((C3010 > 0),\"space\",(IF((D3010 > 0),\"num\",(IF((E3010 > 0),\"punch\",\"text\")))))","v":"space"},{"$f":"IFERROR(FIND(A3010,\" \",1),0)","v":1},{"$f":"IFERROR(FIND(A3010,\"1234567890\",1),0)","v":1},{"$f":"IFERROR(FIND(A3010,\".\",1),0)","v":1}]
[null,"space",1,1,1]
[null,"space",1,1,1]
[null,"space",1,1,1]
[null,"space",1,1,1]
[null,"space",1,1,1]
[null,"space",1,1,1]
[null,"space",1,1,1]
[null,"space",1,1,1]
[null,"space",1,1,1]
[null,"space",1,1,1]
[null,"space",1,1,1]
[null,"space",1,1,1]
[null,"space",1,1,1]
[null,"space",1,1,1]
[null,"space",1,1,1]
[null,"space",1,1,1]
[null,"space",1,1,1]
[null,"space",1,1,1]
[null,"space",1,1,1]
[null,"space",1,1,1]
[null,"space",1,1,1]
[null,"space",1,1,1]
[null,"space",1,1,1]
[null,"space",1,1,1]
[null,"space",1,1,1]
[null,"space",1,1,1]
[null,"space",1,1,1]
[null,"space",1,1,1]
[null,"space",1,1,1]
[null,"space",1,1,1]
[null,"space",1,1,1]
[null,"space",1,1,1]
[null,"space",1,1,1]
[null,"space",1,1,1]
[null,"space",1,1,1]
[null,"space",1,1,1]
[null,"space",1,1,1]
[null,"space",1,1,1]
[null,"space",1,1,1]
[null,"space",1,1,1]
[null,"space",1,1,1]
[null,"space",1,1,1]
[null,"space",1,1,1]
[null,"space",1,1,1]
[null,"space",1,1,1]
[null,"space",1,1,1]
[null,"space",1,1,1]
[null,"space",1,1,1]
[null,"space",1,1,1]
[null,"space",1,1,1]
[null,"space",1,1,1]
[null,"space",1,1,1]
[null,"space",1,1,1]
[null,"space",1,1,1]
[null,"space",1,1,1]
[null,"space",1,1,1]
[null,"space",1,1,1]
[null,"space",1,1,1]
[null,"space",1,1,1]
[null,"space",1,1,1]
[null,"space",1,1,1]
[null,"space",1,1,1]
[null,"space",1,1,1]
[null,{"$f":"IF((C3074 > 0),\"space\",(IF((D3074 > 0),\"num\",(IF((E3074 > 0),\"punch\",\"text\")))))","v":"space"},{"$f":"IFERROR(FIND(A3074,\" \",1),0)","v":1},{"$f":"IFERROR(FIND(A3074,\"1234567890\",1),0)","v":1},{"$f":"IFERROR(FIND(A3074,\".\",1),0)","v":1}]
[null,"space",1,1,1]
[null,"space",1,1,1]
[null,"space",1,1,1]
[null,"space",1,1,1]
[null,"space",1,1,1]
[null,"space",1,1,1]
[null,"space",1,1,1]
[null,"space",1,1,1]
[null,"space",1,1,1]
[null,"space",1,1,1]
[null,"space",1,1,1]
[null,"space",1,1,1]
[null,"space",1,1,1]
[null,"space",1,1,1]
[null,"space",1,1,1]
[null,"space",1,1,1]
[null,"space",1,1,1]
[null,"space",1,1,1]
[null,"space",1,1,1]
[null,"space",1,1,1]
[null,"space",1,1,1]
[null,"space",1,1,1]
[null,"space",1,1,1]
[null,"space",1,1,1]
[null,"space",1,1,1]
[null,"space",1,1,1]
[null,"space",1,1,1]
[null,"space",1,1,1]
[null,"space",1,1,1]
[null,"space",1,1,1]
[null,"space",1,1,1]
[null,"space",1,1,1]
[null,"space",1,1,1]
[null,"space",1,1,1]
[null,"space",1,1,1]
[null,"space",1,1,1]
[null,"space",1,1,1]
[null,"space",1,1,1]
[null,"space",1,1,1]
[null,"space",1,1,1]
[null,"space",1,1,1]
[null,"space",1,1,1]
[null,"space",1,1,1]
[null,"space",1,1,1]
[null,"space",1,1,1]
[null,"space",1,1,1]
[null,"space",1,1,1]
[null,"space",1,1,1]
[null,"space",1,1,1]
[null,"space",1,1,1]
[null,"space",1,1,1]
[null,"space",1,1,1]
[null,"space",1,1,1]
[null,"space",1,1,1]
[null,"space",1,1,1]
[null,"space",1,1,1]
[null,"space",1,1,1]
[null,"space",1,1,1]
[null,"space",1,1,1]
[null,"space",1,1,1]
[null,"space",1,1,1]
[null,"space",1,1,1]
[null,"space",1,1,1]
[null,{"$f":"IF((C3138 > 0),\"space\",(IF((D3138 > 0),\"num\",(IF((E3138 > 0),\"punch\",\"text\")))))","v":"space"},{"$f":"IFERROR(FIND(A3138,\" \",1),0)","v":1},{"$f":"IFERROR(FIND(A3138,\"1234567890\",1),0)","v":1},{"$f":"IFERROR(FIND(A3138,\".\",1),0)","v":1}]
[null,"space",1,1,1]
[null,"space",1,1,1]
[null,"space",1,1,1]
[null,"space",1,1,1]
[null,"space",1,1,1]
[null,"space",1,1,1]
[null,"space",1,1,1]
[null,"space",1,1,1]
[null,"space",1,1,1]
[null,"space",1,1,1]
[null,"space",1,1,1]
[null,"space",1,1,1]
[null,"space",1,1,1]
[null,"space",1,1,1]
[null,"space",1,1,1]
[null,"space",1,1,1]
[null,"space",1,1,1]
[null,"space",1,1,1]
[null,"space",1,1,1]
[null,"space",1,1,1]
[null,"space",1,1,1]
[null,"space",1,1,1]
[null,"space",1,1,1]
[null,"space",1,1,1]
[null,"space",1,1,1]
[null,"space",1,1,1]
[null,"space",1,1,1]
[null,"space",1,1,1]
[null,"space",1,1,1]
[null,"space",1,1,1]
[null,"space",1,1,1]
[null,"space",1,1,1]
[null,"space",1,1,1]
[null,"space",1,1,1]
[null,"space",1,1,1]
[null,"space",1,1,1]
[null,"space",1,1,1]
[null,"space",1,1,1]
[null,"space",1,1,1]
[null,"space",1,1,1]
[null,"space",1,1,1]
[null,"space",1,1,1]
[null,"space",1,1,1]
[null,"space",1,1,1]
[null,"space",1,1,1]
[null,"space",1,1,1]
[null,"space",1,1,1]
[null,"space",1,1,1]
[null,"space",1,1,1]
[null,"space",1,1,1]
[null,"space",1,1,1]
[null,"space",1,1,1]
[null,"space",1,1,1]
[null,"space",1,1,1]
[null,"space",1,1,1]
[null,"space",1,1,1]
[null,"space",1,1,1]
[null,"space",1,1,1]
[null,"space",1,1,1]
[null,"space",1,1,1]
[null,"space",1,1,1]
[null,"space",1,1,1]
[null,"space",1,1,1]
[null,{"$f":"IF((C3202 > 0),\"space\",(IF((D3202 > 0),\"num\",(IF((E3202 > 0),\"punch\",\"text\")))))","v":"space"},{"$f":"IFERROR(FIND(A3202,\" \",1),0)","v":1},{"$f":"IFERROR(FIND(A3202,\"1234567890\",1),0)","v":1},{"$f":"IFERROR(FIND(A3202,\".\",1),0)","v":1}]
[null,"space",1,1,1]
[null,"space",1,1,1]
[null,"space",1,1,1]
[null,"space",1,1,1]
[null,"space",1,1,1]
[null,"space",1,1,1]
[null,"space",1,1,1]
[null,"space",1,1,1]
[null,"space",1,1,1]
[null,"space",1,1,1]
[null,"space",1,1,1]
[null,"space",1,1,1]
[null,"space",1,1,1]
[null,"space",1,1,1]
[null,"space",1,1,1]
[null,"space",1,1,1]
[null,"space",1,1,1]
[null,"space",1,1,1]
[null,"space",1,1,1]
[null,"space",1,1,1]
[null,"space",1,1,1]
[null,"space",1,1,1]
[null,"space",1,1,1]
[null,"space",1,1,1]
[null,"space",1,1,1]
[null,"space",1,1,1]
[null,"space",1,1,1]
[null,"space",1,1,1]
[null,"space",1,1,1]
[null,"space",1,1,1]
[null,"space",1,1,1]
[null,"space",1,1,1]
[null,"space",1,1,1]
[null,"space",1,1,1]
[null,"space",1,1,1]
[null,"space",1,1,1]
[null,"space",1,1,1]
[null,"space",1,1,1]
[null,"space",1,1,1]
[null,"space",1,1,1]
[null,"space",1,1,1]
[null,"space",1,1,1]
[null,"space",1,1,1]
[null,"space",1,1,1]
[null,"space",1,1,1]
[null,"space",1,1,1]
[null,"space",1,1,1]
[null,"space",1,1,1]
[null,"space",1,1,1]
[null,"space",1,1,1]
[null,"space",1,1,1]
[null,"space",1,1,1]
[null,"space",1,1,1]
[null,"space",1,1,1]
[null,"space",1,1,1]
[null,"space",1,1,1]
[null,"space",1,1,1]
[null,"space",1,1,1]
[null,"space",1,1,1]
[null,"space",1,1,1]
[null,"space",1,1,1]
[null,"space",1,1,1]
[null,"space",1,1,1]
[null,{"$f":"IF((C3266 > 0),\"space\",(IF((D3266 > 0),\"num\",(IF((E3266 > 0),\"punch\",\"text\")))))","v":"space"},{"$f":"IFERROR(FIND(A3266,\" \",1),0)","v":1},{"$f":"IFERROR(FIND(A3266,\"1234567890\",1),0)","v":1},{"$f":"IFERROR(FIND(A3266,\".\",1),0)","v":1}]
[null,"space",1,1,1]
[null,"space",1,1,1]
[null,"space",1,1,1]
[null,"space",1,1,1]
[null,"space",1,1,1]
[null,"space",1,1,1]
[null,"space",1,1,1]
[null,"space",1,1,1]
[null,"space",1,1,1]
[null,"space",1,1,1]
[null,"space",1,1,1]
[null,"space",1,1,1]
[null,"space",1,1,1]
[null,"space",1,1,1]
[null,"space",1,1,1]
[null,"space",1,1,1]
[null,"space",1,1,1]
[null,"space",1,1,1]
[null,"space",1,1,1]
[null,"space",1,1,1]
[null,"space",1,1,1]
[null,"space",1,1,1]
[null,"space",1,1,1]
[null,"space",1,1,1]
[null,"space",1,1,1]
[null,"space",1,1,1]
[null,"space",1,1,1]
[null,"space",1,1,1]
[null,"space",1,1,1]
[null,"space",1,1,1]
[null,"space",1,1,1]
[null,"space",1,1,1]
[null,"space",1,1,1]
[null,"space",1,1,1]
[null,"space",1,1,1]
[null,"space",1,1,1]
[null,"space",1,1,1]
[null,"space",1,1,1]
[null,"space",1,1,1]
[null,"space",1,1,1]
[null,"space",1,1,1]
[null,"space",1,1,1]
[null,"space",1,1,1]
[null,"space",1,1,1]
[null,"space",1,1,1]
[null,"space",1,1,1]